BDBM50361799 CHEMBL1938640
SMILES: CCCCCCCCCCO[C@H]1C=C(COC(C)=O)C(=O)[C@@H]2O[C@@](C)(OC)[C@](C)(OC)O[C@@H]12
InChI Key: InChIKey=JTZVQHJRDDOFMJ-OXZBAMKGSA-N
Data: 3 IC50
Activity Spreadsheet -- Enzyme Inhibition Constant Data from BindingDB
Found 3 hits for monomerid = 50361799
Trg + Lig
Ki
nM
ΔG°
kcal/mole
IC50
nM
Kd
nM
EC50/IC50
nM
koff
s-1
kon
M-1s-1
pHTemp
°C
Glutathione S-transferase A2
(Homo sapiens (Human))
BDBM50361799
(CHEMBL1938640)
Show SMILES CCCCCCCCCCO[C@H]1C=C(COC(C)=O)C(=O)[C@@H]2O[C@@](C)(OC)[C@](C)(OC)O[C@@H]12 |r,t:12|
Show InChI InChI=1S/C25H42O8/c1-7-8-9-10-11-12-13-14-15-30-20-16-19(17-31-18(2)26)21(27)23-22(20)32-24(3,28-5)25(4,29-6)33-23/h16,20,22-23H,7-15,17H2,1-6H3/t20-,22-,23-,24+,25+/m0/s1
Reactome pathway
n/an/a 3.31E+4n/an/an/an/an/an/a
Institute of Chemistry, Academia Sinica
Curated by ChEMBL
Assay Description
Inhibition of human GSTA2 using GSH as substrate after 3 mins by spectrophotometry
J Med Chem 54: 8574-81 (2011)
Article DOI: 10.1021/jm201131n
BindingDB Entry DOI: 10.7270/Q26D5TDT
Glutathione transferase (GST)
(Homo sapiens (Human))
BDBM50361799
(CHEMBL1938640)
Show SMILES CCCCCCCCCCO[C@H]1C=C(COC(C)=O)C(=O)[C@@H]2O[C@@](C)(OC)[C@](C)(OC)O[C@@H]12 |r,t:12|
Show InChI InChI=1S/C25H42O8/c1-7-8-9-10-11-12-13-14-15-30-20-16-19(17-31-18(2)26)21(27)23-22(20)32-24(3,28-5)25(4,29-6)33-23/h16,20,22-23H,7-15,17H2,1-6H3/t20-,22-,23-,24+,25+/m0/s1
n/an/a 3.65E+4n/an/an/an/an/an/a
Institute of Chemistry, Academia Sinica
Curated by ChEMBL
Assay Description
Inhibition of human GSTP1-1 using GSH as substrate after 3 mins by spectrophotometry
J Med Chem 54: 8574-81 (2011)
Article DOI: 10.1021/jm201131n
BindingDB Entry DOI: 10.7270/Q26D5TDT
Glutathione S-transferase Mu 1
(Homo sapiens (Human))
BDBM50361799
(CHEMBL1938640)
Show SMILES CCCCCCCCCCO[C@H]1C=C(COC(C)=O)C(=O)[C@@H]2O[C@@](C)(OC)[C@](C)(OC)O[C@@H]12 |r,t:12|
Show InChI InChI=1S/C25H42O8/c1-7-8-9-10-11-12-13-14-15-30-20-16-19(17-31-18(2)26)21(27)23-22(20)32-24(3,28-5)25(4,29-6)33-23/h16,20,22-23H,7-15,17H2,1-6H3/t20-,22-,23-,24+,25+/m0/s1
NCI pathway
Reactome pathway
n/an/a 3.36E+4n/an/an/an/an/an/a
Institute of Chemistry, Academia Sinica
Curated by ChEMBL
Assay Description
Inhibition of human GSTM1 using GSH as substrate after 3 mins by spectrophotometry
J Med Chem 54: 8574-81 (2011)
Article DOI: 10.1021/jm201131n
BindingDB Entry DOI: 10.7270/Q26D5TDT