BDBM50361803 CHEMBL1938620
SMILES: CC(=O)OCC1C[C@H](O)[C@H](O)C(=O)C1=O
InChI Key: InChIKey=RRYJCAFEZCPKTQ-SXSZQIEUSA-N
Data: 2 IC50
Activity Spreadsheet -- Enzyme Inhibition Constant Data from BindingDB
Found 2 hits for monomerid = 50361803
Trg + Lig
Ki
nM
ΔG°
kcal/mole
IC50
nM
Kd
nM
EC50/IC50
nM
koff
s-1
kon
M-1s-1
pHTemp
°C
Glutathione S-transferase A2
(Homo sapiens (Human))
BDBM50361803
(CHEMBL1938620)
Show SMILES CC(=O)OCC1C[C@H](O)[C@H](O)C(=O)C1=O |r|
Show InChI InChI=1S/C9H12O6/c1-4(10)15-3-5-2-6(11)8(13)9(14)7(5)12/h5-6,8,11,13H,2-3H2,1H3/t5?,6-,8-/m0/s1
Reactome pathway
n/an/a>1.00E+5n/an/an/an/an/an/a
Institute of Chemistry, Academia Sinica
Curated by ChEMBL
Assay Description
Inhibition of human GSTA2 using GSH as substrate after 3 mins by spectrophotometry
J Med Chem 54: 8574-81 (2011)
Article DOI: 10.1021/jm201131n
BindingDB Entry DOI: 10.7270/Q26D5TDT
Glutathione transferase (GST)
(Homo sapiens (Human))
BDBM50361803
(CHEMBL1938620)
Show SMILES CC(=O)OCC1C[C@H](O)[C@H](O)C(=O)C1=O |r|
Show InChI InChI=1S/C9H12O6/c1-4(10)15-3-5-2-6(11)8(13)9(14)7(5)12/h5-6,8,11,13H,2-3H2,1H3/t5?,6-,8-/m0/s1
n/an/a>1.00E+5n/an/an/an/an/an/a
Institute of Chemistry, Academia Sinica
Curated by ChEMBL
Assay Description
Inhibition of human GSTP1-1 using GSH as substrate after 3 mins by spectrophotometry
J Med Chem 54: 8574-81 (2011)
Article DOI: 10.1021/jm201131n
BindingDB Entry DOI: 10.7270/Q26D5TDT