BDBM50361846 CHEMBL1938794::US9150577, 15
SMILES: O=C(Nc1cn[nH]c1)c1ccc2cc3C(=O)NCCCn3c2c1
InChI Key: InChIKey=ULNZFQKAFXCYBO-UHFFFAOYSA-N
Data: 3 IC50
Activity Spreadsheet -- Enzyme Inhibition Constant Data from BindingDB
Found 3 hits for monomerid = 50361846
Trg + Lig
Ki
nM
ΔG°
kcal/mole
IC50
nM
Kd
nM
EC50/IC50
nM
koff
s-1
kon
M-1s-1
pHTemp
°C
Ribosomal protein S6 kinase alpha 2
(Homo sapiens (Human))
BDBM50361846
(CHEMBL1938794 | US9150577, 15)
Show SMILES O=C(Nc1cn[nH]c1)c1ccc2cc3C(=O)NCCCn3c2c1
Show InChI InChI=1S/C16H15N5O2/c22-15(20-12-8-18-19-9-12)11-3-2-10-6-14-16(23)17-4-1-5-21(14)13(10)7-11/h2-3,6-9H,1,4-5H2,(H,17,23)(H,18,19)(H,20,22)
Reactome pathway
US Patent
n/an/a 43n/an/an/an/a7.5n/a
Boehringer Ingelheim International GmbH
US Patent
Assay Description
Human RSK2 protein, purchased from Invitrogen, is used to measure kinase activity utilizing Kinase Glo Plus (Promega) a homogeneous assay technology,...
US Patent US9150577 (2015)
BindingDB Entry DOI: 10.7270/Q2GB22V6
Ribosomal protein S6 kinase alpha-3
(Homo sapiens (Human))
BDBM50361846
(CHEMBL1938794 | US9150577, 15)
Show SMILES O=C(Nc1cn[nH]c1)c1ccc2cc3C(=O)NCCCn3c2c1
Show InChI InChI=1S/C16H15N5O2/c22-15(20-12-8-18-19-9-12)11-3-2-10-6-14-16(23)17-4-1-5-21(14)13(10)7-11/h2-3,6-9H,1,4-5H2,(H,17,23)(H,18,19)(H,20,22)
Reactome pathway
n/an/a 43n/an/an/an/an/an/a
Boehringer-Ingelheim Pharmaceuticals, Inc.
Curated by ChEMBL
Assay Description
Inhibition of RSK2 phosphorylation by luminescence assay
Bioorg Med Chem Lett 22: 733-7 (2011)
Article DOI: 10.1016/j.bmcl.2011.10.030
BindingDB Entry DOI: 10.7270/Q2XW4K7N
Ribosomal protein S6 kinase alpha-3
(Homo sapiens (Human))
BDBM50361846
(CHEMBL1938794 | US9150577, 15)
Show SMILES O=C(Nc1cn[nH]c1)c1ccc2cc3C(=O)NCCCn3c2c1
Show InChI InChI=1S/C16H15N5O2/c22-15(20-12-8-18-19-9-12)11-3-2-10-6-14-16(23)17-4-1-5-21(14)13(10)7-11/h2-3,6-9H,1,4-5H2,(H,17,23)(H,18,19)(H,20,22)
Reactome pathway
n/an/a>1.00E+4n/an/an/an/an/an/a
Boehringer-Ingelheim Pharmaceuticals, Inc.
Curated by ChEMBL
Assay Description
Inhibition of RSK2-mediated CREB phosphorylation in HeLa cells expressing luciferase reporter gene
Bioorg Med Chem Lett 22: 733-7 (2011)
Article DOI: 10.1016/j.bmcl.2011.10.030
BindingDB Entry DOI: 10.7270/Q2XW4K7N