BDBM50361854 CHEMBL1938767::US9150577, 151
SMILES: C[C@@H]1CNC(=O)c2cc3ccc(cc3n2[C@H]1C)C(=O)Nc1cccnc1
InChI Key: InChIKey=DUPMGAVJLVBVOW-OLZOCXBDSA-N
Data: 2 IC50
Activity Spreadsheet -- Enzyme Inhibition Constant Data from BindingDB
Found 2 hits for monomerid = 50361854
Trg + Lig
Ki
nM
ΔG°
kcal/mole
IC50
nM
Kd
nM
EC50/IC50
nM
koff
s-1
kon
M-1s-1
pHTemp
°C
Ribosomal protein S6 kinase alpha-3
(Homo sapiens (Human))
BDBM50361854
(CHEMBL1938767 | US9150577, 151)
Show SMILES C[C@@H]1CNC(=O)c2cc3ccc(cc3n2[C@H]1C)C(=O)Nc1cccnc1 |r|
Show InChI InChI=1S/C20H20N4O2/c1-12-10-22-20(26)18-8-14-5-6-15(9-17(14)24(18)13(12)2)19(25)23-16-4-3-7-21-11-16/h3-9,11-13H,10H2,1-2H3,(H,22,26)(H,23,25)/t12-,13+/m1/s1
Reactome pathway
n/an/a 1.10E+3n/an/an/an/an/an/a
Boehringer-Ingelheim Pharmaceuticals, Inc.
Curated by ChEMBL
Assay Description
Inhibition of RSK2 phosphorylation by luminescence assay
Bioorg Med Chem Lett 22: 733-7 (2011)
Article DOI: 10.1016/j.bmcl.2011.10.030
BindingDB Entry DOI: 10.7270/Q2XW4K7N
Ribosomal protein S6 kinase alpha 2
(Homo sapiens (Human))
BDBM50361854
(CHEMBL1938767 | US9150577, 151)
Show SMILES C[C@@H]1CNC(=O)c2cc3ccc(cc3n2[C@H]1C)C(=O)Nc1cccnc1 |r|
Show InChI InChI=1S/C20H20N4O2/c1-12-10-22-20(26)18-8-14-5-6-15(9-17(14)24(18)13(12)2)19(25)23-16-4-3-7-21-11-16/h3-9,11-13H,10H2,1-2H3,(H,22,26)(H,23,25)/t12-,13+/m1/s1
Reactome pathway
US Patent
n/an/a 1.10E+3n/an/an/an/a7.5n/a
Boehringer Ingelheim International GmbH
US Patent
Assay Description
Human RSK2 protein, purchased from Invitrogen, is used to measure kinase activity utilizing Kinase Glo Plus (Promega) a homogeneous assay technology,...
US Patent US9150577 (2015)
BindingDB Entry DOI: 10.7270/Q2GB22V6