BDBM50361864 CHEMBL1938784::US9150577, 216
SMILES: Clc1ccccc1NC(=O)c1ccc2cc3C(=O)NCCCn3c2c1
InChI Key: InChIKey=AREDMWBKBLAWAL-UHFFFAOYSA-N
Data: 2 IC50
Activity Spreadsheet -- Enzyme Inhibition Constant Data from BindingDB
Found 2 hits for monomerid = 50361864
Trg + Lig
Ki
nM
ΔG°
kcal/mole
IC50
nM
Kd
nM
EC50/IC50
nM
koff
s-1
kon
M-1s-1
pHTemp
°C
Ribosomal protein S6 kinase alpha-3
(Homo sapiens (Human))
BDBM50361864
(CHEMBL1938784 | US9150577, 216)
Show SMILES Clc1ccccc1NC(=O)c1ccc2cc3C(=O)NCCCn3c2c1
Show InChI InChI=1S/C19H16ClN3O2/c20-14-4-1-2-5-15(14)22-18(24)13-7-6-12-10-17-19(25)21-8-3-9-23(17)16(12)11-13/h1-2,4-7,10-11H,3,8-9H2,(H,21,25)(H,22,24)
Reactome pathway
n/an/a 6.00E+3n/an/an/an/an/an/a
Boehringer-Ingelheim Pharmaceuticals, Inc.
Curated by ChEMBL
Assay Description
Inhibition of RSK2 phosphorylation by luminescence assay
Bioorg Med Chem Lett 22: 733-7 (2011)
Article DOI: 10.1016/j.bmcl.2011.10.030
BindingDB Entry DOI: 10.7270/Q2XW4K7N
Ribosomal protein S6 kinase alpha 2
(Homo sapiens (Human))
BDBM50361864
(CHEMBL1938784 | US9150577, 216)
Show SMILES Clc1ccccc1NC(=O)c1ccc2cc3C(=O)NCCCn3c2c1
Show InChI InChI=1S/C19H16ClN3O2/c20-14-4-1-2-5-15(14)22-18(24)13-7-6-12-10-17-19(25)21-8-3-9-23(17)16(12)11-13/h1-2,4-7,10-11H,3,8-9H2,(H,21,25)(H,22,24)
Reactome pathway
US Patent
n/an/a 6.00E+3n/an/an/an/a7.5n/a
Boehringer Ingelheim International GmbH
US Patent
Assay Description
Human RSK2 protein, purchased from Invitrogen, is used to measure kinase activity utilizing Kinase Glo Plus (Promega) a homogeneous assay technology,...
US Patent US9150577 (2015)
BindingDB Entry DOI: 10.7270/Q2GB22V6