BDBM50361874 CHEMBL1938783::US9150577, 1
SMILES: Clc1cccc(NC(=O)c2ccc3cc4C(=O)NCCCn4c3c2)c1
InChI Key: InChIKey=BTCGJYJHCYOBJS-UHFFFAOYSA-N
Data: 2 IC50
Activity Spreadsheet -- Enzyme Inhibition Constant Data from BindingDB
Found 2 hits for monomerid = 50361874
Trg + Lig
Ki
nM
ΔG°
kcal/mole
IC50
nM
Kd
nM
EC50/IC50
nM
koff
s-1
kon
M-1s-1
pHTemp
°C
Ribosomal protein S6 kinase alpha-3
(Homo sapiens (Human))
BDBM50361874
(CHEMBL1938783 | US9150577, 1)
Show SMILES Clc1cccc(NC(=O)c2ccc3cc4C(=O)NCCCn4c3c2)c1
Show InChI InChI=1S/C19H16ClN3O2/c20-14-3-1-4-15(11-14)22-18(24)13-6-5-12-9-17-19(25)21-7-2-8-23(17)16(12)10-13/h1,3-6,9-11H,2,7-8H2,(H,21,25)(H,22,24)
Reactome pathway
n/an/a 270n/an/an/an/an/an/a
Boehringer-Ingelheim Pharmaceuticals, Inc.
Curated by ChEMBL
Assay Description
Inhibition of RSK2 phosphorylation by luminescence assay
Bioorg Med Chem Lett 22: 733-7 (2011)
Article DOI: 10.1016/j.bmcl.2011.10.030
BindingDB Entry DOI: 10.7270/Q2XW4K7N
Ribosomal protein S6 kinase alpha 2
(Homo sapiens (Human))
BDBM50361874
(CHEMBL1938783 | US9150577, 1)
Show SMILES Clc1cccc(NC(=O)c2ccc3cc4C(=O)NCCCn4c3c2)c1
Show InChI InChI=1S/C19H16ClN3O2/c20-14-3-1-4-15(11-14)22-18(24)13-6-5-12-9-17-19(25)21-7-2-8-23(17)16(12)10-13/h1,3-6,9-11H,2,7-8H2,(H,21,25)(H,22,24)
Reactome pathway
US Patent
n/an/a 270n/an/an/an/a7.5n/a
Boehringer Ingelheim International GmbH
US Patent
Assay Description
Human RSK2 protein, purchased from Invitrogen, is used to measure kinase activity utilizing Kinase Glo Plus (Promega) a homogeneous assay technology,...
US Patent US9150577 (2015)
BindingDB Entry DOI: 10.7270/Q2GB22V6