BDBM50362155 CHEMBL1941116
SMILES: OC(=O)COc1cccc(CCCn2cc(ccc2=O)C(c2ccccc2)c2ccccc2)c1
InChI Key: InChIKey=VZKQWUSMUDKQQO-UHFFFAOYSA-N
Data: 3 IC50
Activity Spreadsheet -- Enzyme Inhibition Constant Data from BindingDB
Found 3 hits for monomerid = 50362155
Trg + Lig
Ki
nM
ΔG°
kcal/mole
IC50
nM
Kd
nM
EC50/IC50
nM
koff
s-1
kon
M-1s-1
pHTemp
°C
G protein-coupled receptor 44
(Homo sapiens (Human))
BDBM50362155
(CHEMBL1941116)
Show SMILES OC(=O)COc1cccc(CCCn2cc(ccc2=O)C(c2ccccc2)c2ccccc2)c1
Show InChI InChI=1S/C29H27NO4/c31-27-17-16-25(29(23-11-3-1-4-12-23)24-13-5-2-6-14-24)20-30(27)18-8-10-22-9-7-15-26(19-22)34-21-28(32)33/h1-7,9,11-17,19-20,29H,8,10,18,21H2,(H,32,33)
Reactome pathway
n/an/a 42n/an/an/an/an/an/a
Astellas Pharma Inc.
Curated by ChEMBL
Assay Description
Displacement of [3H]PGD2 from human CRTH2 receptor expressed in HEK293 cells after 2 hrs by scintillation counting
Bioorg Med Chem Lett 22: 1194-7 (2012)
Article DOI: 10.1016/j.bmcl.2011.11.079
BindingDB Entry DOI: 10.7270/Q2765FSF
Prostanoid DP receptor
(Homo sapiens (Human))
BDBM50362155
(CHEMBL1941116)
Show SMILES OC(=O)COc1cccc(CCCn2cc(ccc2=O)C(c2ccccc2)c2ccccc2)c1
Show InChI InChI=1S/C29H27NO4/c31-27-17-16-25(29(23-11-3-1-4-12-23)24-13-5-2-6-14-24)20-30(27)18-8-10-22-9-7-15-26(19-22)34-21-28(32)33/h1-7,9,11-17,19-20,29H,8,10,18,21H2,(H,32,33)
n/an/a>1.00E+3n/an/an/an/an/an/a
Astellas Pharma Inc.
Curated by ChEMBL
Assay Description
Displacement of [3H]PGD2 from human DP1 receptor expressed in HEK293 cells after 2 hrs by scintillation counting
Bioorg Med Chem Lett 22: 1194-7 (2012)
Article DOI: 10.1016/j.bmcl.2011.11.079
BindingDB Entry DOI: 10.7270/Q2765FSF
Chemoattractant receptor-homologous molecule expressed on Th2 cells
(Cavia porcellus)
BDBM50362155
(CHEMBL1941116)
Show SMILES OC(=O)COc1cccc(CCCn2cc(ccc2=O)C(c2ccccc2)c2ccccc2)c1
Show InChI InChI=1S/C29H27NO4/c31-27-17-16-25(29(23-11-3-1-4-12-23)24-13-5-2-6-14-24)20-30(27)18-8-10-22-9-7-15-26(19-22)34-21-28(32)33/h1-7,9,11-17,19-20,29H,8,10,18,21H2,(H,32,33)
n/an/a 256n/an/an/an/an/an/a
Astellas Pharma Inc.
Curated by ChEMBL
Assay Description
Displacement of [3H]PGD2 from guinea pig CRTH2 receptor expressed in HEK293 cells after 2 hrs by scintillation counting
Bioorg Med Chem Lett 22: 1194-7 (2012)
Article DOI: 10.1016/j.bmcl.2011.11.079
BindingDB Entry DOI: 10.7270/Q2765FSF