BDBM50362170 CHEMBL1938682
SMILES: Clc1ccc(cc1)-c1cc2Cc3cc(ccc3NC(=O)c2o1)N1CCNCC1
InChI Key: InChIKey=FUZHDIGYHQYSHU-UHFFFAOYSA-N
Data: 2 IC50
Activity Spreadsheet -- Enzyme Inhibition Constant Data from BindingDB
Found 2 hits for monomerid = 50362170
Trg + Lig
Ki
nM
ΔG°
kcal/mole
IC50
nM
Kd
nM
EC50/IC50
nM
koff
s-1
kon
M-1s-1
pHTemp
°C
MAP kinase-activated protein kinase 2
(Homo sapiens (Human))
BDBM50362170
(CHEMBL1938682)
Show SMILES Clc1ccc(cc1)-c1cc2Cc3cc(ccc3NC(=O)c2o1)N1CCNCC1
Show InChI InChI=1S/C22H20ClN3O2/c23-17-3-1-14(2-4-17)20-13-16-11-15-12-18(26-9-7-24-8-10-26)5-6-19(15)25-22(27)21(16)28-20/h1-6,12-13,24H,7-11H2,(H,25,27)
NCI pathway
Reactome pathway
n/an/a 96n/an/an/an/an/an/a
Merck Research Laboratories
Curated by ChEMBL
Assay Description
Inhibition of MK2 (unknown origin) phosphorylation using TAMRA labeled peptide as substrate incubated 30 mins before substrate addition measured afte...
Bioorg Med Chem Lett 23: 3262-6 (2013)
Article DOI: 10.1016/j.bmcl.2013.03.109
BindingDB Entry DOI: 10.7270/Q2ZS2XX8
MAP kinase-activated protein kinase 2
(Homo sapiens (Human))
BDBM50362170
(CHEMBL1938682)
Show SMILES Clc1ccc(cc1)-c1cc2Cc3cc(ccc3NC(=O)c2o1)N1CCNCC1
Show InChI InChI=1S/C22H20ClN3O2/c23-17-3-1-14(2-4-17)20-13-16-11-15-12-18(26-9-7-24-8-10-26)5-6-19(15)25-22(27)21(16)28-20/h1-6,12-13,24H,7-11H2,(H,25,27)
NCI pathway
Reactome pathway
n/an/a 96n/an/an/an/an/an/a
Merck Research Laboratories
Curated by ChEMBL
Assay Description
Inhibition of MK2 using TAMRA-labeled peptide as substrate pre-incubated for 30 mins prior substrate addition measured after 30 mins incubation in da...
Bioorg Med Chem Lett 22: 1068-72 (2012)
Article DOI: 10.1016/j.bmcl.2011.11.113
BindingDB Entry DOI: 10.7270/Q23J3DDJ