null
SMILES: Cc1cc(C)c2cc1-c1cc(Sc3cccc(OCCCCNC2=O)c3)nc(N)n1
InChI Key: InChIKey=INCKCPRNUKUIPD-UHFFFAOYSA-N
Activity Spreadsheet -- Enzyme Inhibition Constant Data from BindingDB
Found 1 hit for monomerid = 50362230
Trg + Lig
Ki
nM
ΔG°
kcal/mole
IC50
nM
Kd
nM
EC50/IC50
nM
koff
s-1
kon
M-1s-1
pHTemp
°C
Heat shock protein HSP 90-alpha
(Homo sapiens (Human))
BDBM50362230
(CHEMBL1939375)
Show SMILES Cc1cc(C)c2cc1-c1cc(Sc3cccc(OCCCCNC2=O)c3)nc(N)n1
Show InChI InChI=1S/C23H24N4O2S/c1-14-10-15(2)19-12-18(14)20-13-21(27-23(24)26-20)30-17-7-5-6-16(11-17)29-9-4-3-8-25-22(19)28/h5-7,10-13H,3-4,8-9H2,1-2H3,(H,25,28)(H2,24,26,27)
NCI pathway
Reactome pathway
n/an/an/a 7.40n/an/an/an/an/a
Chugai Pharmaceutical Co., Ltd
Curated by ChEMBL
Assay Description
Binding affinity to N-terminus biotinylated human Hsp90 alpha by surface plasmon resonance assay
Bioorg Med Chem Lett 22: 1136-41 (2012)
Article DOI: 10.1016/j.bmcl.2011.11.100
BindingDB Entry DOI: 10.7270/Q2KH0NS7