null
SMILES: CCOC(=O)Nc1ccccc1[C@H](N1CCN(Cc2cscn2)CC1)c1ccc(cc1)C(=O)N(CC)CC
InChI Key: InChIKey=QIUQYNYDAOLCOC-HHHXNRCGSA-N
Activity Spreadsheet -- Enzyme Inhibition Constant Data from BindingDB
Found 2 hits for monomerid = 50362305
Trg + Lig
Ki
nM
ΔG°
kcal/mole
IC50
nM
Kd
nM
EC50/IC50
nM
koff
s-1
kon
M-1s-1
pHTemp
°C
Potassium voltage-gated channel subfamily H member 2
(Homo sapiens (Human))
BDBM50362305
(CHEMBL1939745)
Show SMILES CCOC(=O)Nc1ccccc1[C@H](N1CCN(Cc2cscn2)CC1)c1ccc(cc1)C(=O)N(CC)CC |r|
Show InChI InChI=1S/C29H37N5O3S/c1-4-33(5-2)28(35)23-13-11-22(12-14-23)27(25-9-7-8-10-26(25)31-29(36)37-6-3)34-17-15-32(16-18-34)19-24-20-38-21-30-24/h7-14,20-21,27H,4-6,15-19H2,1-3H3,(H,31,36)/t27-/m1/s1
Reactome pathway
n/an/a 8.70E+3n/an/an/an/an/an/a
AstraZeneca Pharmaceuticals
Curated by ChEMBL
Assay Description
Inhibition of human Erg
Bioorg Med Chem Lett 22: 1169-73 (2012)
Article DOI: 10.1016/j.bmcl.2011.11.088
BindingDB Entry DOI: 10.7270/Q269741B
Delta-type opioid receptor
(Homo sapiens (Human))
BDBM50362305
(CHEMBL1939745)
Show SMILES CCOC(=O)Nc1ccccc1[C@H](N1CCN(Cc2cscn2)CC1)c1ccc(cc1)C(=O)N(CC)CC |r|
Show InChI InChI=1S/C29H37N5O3S/c1-4-33(5-2)28(35)23-13-11-22(12-14-23)27(25-9-7-8-10-26(25)31-29(36)37-6-3)34-17-15-32(16-18-34)19-24-20-38-21-30-24/h7-14,20-21,27H,4-6,15-19H2,1-3H3,(H,31,36)/t27-/m1/s1
Reactome pathway
n/an/a 0.780n/an/an/an/an/an/a
AstraZeneca Pharmaceuticals
Curated by ChEMBL
Assay Description
Displacement of [I125]deltorphin from delta-opioid receptor overexpressed in human HEK293 cells
Bioorg Med Chem Lett 22: 1169-73 (2012)
Article DOI: 10.1016/j.bmcl.2011.11.088
BindingDB Entry DOI: 10.7270/Q269741B