null
SMILES: CCN1CC[C@H](NC(=O)C[C@H]2N(C=CNC2=O)S(=O)(=O)c2ccc(C)cc2)C(C)(C)C1
InChI Key: InChIKey=ULSOVDFFPGLDJK-MOPGFXCFSA-N
Activity Spreadsheet -- Enzyme Inhibition Constant Data from BindingDB
Found 1 hit for monomerid = 50362336
Trg + Lig
Ki
nM
ΔG°
kcal/mole
IC50
nM
Kd
nM
EC50/IC50
nM
koff
s-1
kon
M-1s-1
pHTemp
°C
B1 bradykinin receptor
(Homo sapiens (Human))
BDBM50362336
(CHEMBL1939932)
Show SMILES CCN1CC[C@H](NC(=O)C[C@H]2N(C=CNC2=O)S(=O)(=O)c2ccc(C)cc2)C(C)(C)C1 |r,c:12|
Show InChI InChI=1S/C22H32N4O4S/c1-5-25-12-10-19(22(3,4)15-25)24-20(27)14-18-21(28)23-11-13-26(18)31(29,30)17-8-6-16(2)7-9-17/h6-9,11,13,18-19H,5,10,12,14-15H2,1-4H3,(H,23,28)(H,24,27)/t18-,19+/m1/s1
n/an/a 0.630n/an/an/an/an/an/a
Amgen, Inc.
Curated by ChEMBL
Assay Description
Antagonist activity at human bradykinin B1 receptor expressed in CHO-D-/aequorin cells assessed as inhibition of DAK-induced intracellular calcium le...
Bioorg Med Chem Lett 22: 1061-7 (2012)
Article DOI: 10.1016/j.bmcl.2011.11.112
BindingDB Entry DOI: 10.7270/Q22J6CB2