BDBM50362363 CHEMBL1939758
SMILES: Cc1ccc(cc1)S(=O)(=O)N1C=CNC(=O)[C@H]1CC(=O)N[C@@H]1CCCc2cc(CN3CCCC3)ccc12
InChI Key: InChIKey=MSIPSZHIBCCSGJ-CLJLJLNGSA-N
Data: 1 KI  1 IC50
Activity Spreadsheet -- Enzyme Inhibition Constant Data from BindingDB
Found 2 hits for monomerid = 50362363
Trg + Lig
Ki
nM
ΔG°
kcal/mole
IC50
nM
Kd
nM
EC50/IC50
nM
koff
s-1
kon
M-1s-1
pHTemp
°C
B1 bradykinin receptor
(Homo sapiens (Human))
BDBM50362363
(CHEMBL1939758)
Show SMILES Cc1ccc(cc1)S(=O)(=O)N1C=CNC(=O)[C@H]1CC(=O)N[C@@H]1CCCc2cc(CN3CCCC3)ccc12 |r,c:12|
Show InChI InChI=1S/C28H34N4O4S/c1-20-7-10-23(11-8-20)37(35,36)32-16-13-29-28(34)26(32)18-27(33)30-25-6-4-5-22-17-21(9-12-24(22)25)19-31-14-2-3-15-31/h7-13,16-17,25-26H,2-6,14-15,18-19H2,1H3,(H,29,34)(H,30,33)/t25-,26-/m1/s1
0.197n/an/an/an/an/an/an/an/a
Amgen, Inc.
Curated by ChEMBL
Assay Description
Displacement of [3H]-DAK from human bradykinin B1 receptor expressed in CHO-D-/aequorin cells membrane after 90 mins by scintillation counting
Bioorg Med Chem Lett 22: 1061-7 (2012)
Article DOI: 10.1016/j.bmcl.2011.11.112
BindingDB Entry DOI: 10.7270/Q22J6CB2
B1 bradykinin receptor
(Homo sapiens (Human))
BDBM50362363
(CHEMBL1939758)
Show SMILES Cc1ccc(cc1)S(=O)(=O)N1C=CNC(=O)[C@H]1CC(=O)N[C@@H]1CCCc2cc(CN3CCCC3)ccc12 |r,c:12|
Show InChI InChI=1S/C28H34N4O4S/c1-20-7-10-23(11-8-20)37(35,36)32-16-13-29-28(34)26(32)18-27(33)30-25-6-4-5-22-17-21(9-12-24(22)25)19-31-14-2-3-15-31/h7-13,16-17,25-26H,2-6,14-15,18-19H2,1H3,(H,29,34)(H,30,33)/t25-,26-/m1/s1
n/an/a 0.0840n/an/an/an/an/an/a
Amgen, Inc.
Curated by ChEMBL
Assay Description
Antagonist activity at human bradykinin B1 receptor expressed in CHO-D-/aequorin cells assessed as inhibition of DAK-induced intracellular calcium le...
Bioorg Med Chem Lett 22: 1061-7 (2012)
Article DOI: 10.1016/j.bmcl.2011.11.112
BindingDB Entry DOI: 10.7270/Q22J6CB2