null
SMILES: Cc1cnccc1N1CCN(CC1)C(=O)CCNS(=O)(=O)c1cccc2nsnc12
InChI Key: InChIKey=XUQGOXXHHXVALG-UHFFFAOYSA-N
Activity Spreadsheet -- Enzyme Inhibition Constant Data from BindingDB
Found 1 hit for monomerid = 50362368
Trg + Lig
Ki
nM
ΔG°
kcal/mole
IC50
nM
Kd
nM
EC50/IC50
nM
koff
s-1
kon
M-1s-1
pHTemp
°C
Muscarinic acetylcholine receptor M1
(Homo sapiens (Human))
BDBM50362368
(CHEMBL1939954)
Show SMILES Cc1cnccc1N1CCN(CC1)C(=O)CCNS(=O)(=O)c1cccc2nsnc12
Show InChI InChI=1S/C19H22N6O3S2/c1-14-13-20-7-5-16(14)24-9-11-25(12-10-24)18(26)6-8-21-30(27,28)17-4-2-3-15-19(17)23-29-22-15/h2-5,7,13,21H,6,8-12H2,1H3
n/an/a 2.00E+3n/an/an/an/an/an/a
Vanderbilt University Medical Center
Curated by ChEMBL
Assay Description
Antagonist activity at human muscarinic M1 receptor expressed in CHO cells assessed as inhibition of acetylcholine-induced calcium mobilization by fl...
Bioorg Med Chem Lett 22: 1044-8 (2012)
Article DOI: 10.1016/j.bmcl.2011.11.110
BindingDB Entry DOI: 10.7270/Q2XS5VVC