null
SMILES: O=C(CCNS(=O)(=O)c1cccc2nsnc12)N1CCN(CC1)c1ccccn1
InChI Key: InChIKey=PAUICUBCWHEEDI-UHFFFAOYSA-N
Activity Spreadsheet -- Enzyme Inhibition Constant Data from BindingDB
Found 1 hit for monomerid = 50362371
Trg + Lig
Ki
nM
ΔG°
kcal/mole
IC50
nM
Kd
nM
EC50/IC50
nM
koff
s-1
kon
M-1s-1
pHTemp
°C
Muscarinic acetylcholine receptor M1
(Homo sapiens (Human))
BDBM50362371
(CHEMBL1531873)
Show SMILES O=C(CCNS(=O)(=O)c1cccc2nsnc12)N1CCN(CC1)c1ccccn1
Show InChI InChI=1S/C18H20N6O3S2/c25-17(24-12-10-23(11-13-24)16-6-1-2-8-19-16)7-9-20-29(26,27)15-5-3-4-14-18(15)22-28-21-14/h1-6,8,20H,7,9-13H2
n/an/a>1.00E+4n/an/an/an/an/an/a
Vanderbilt University Medical Center
Curated by ChEMBL
Assay Description
Antagonist activity at human muscarinic M1 receptor expressed in CHO cells assessed as inhibition of acetylcholine-induced calcium mobilization by fl...
Bioorg Med Chem Lett 22: 1044-8 (2012)
Article DOI: 10.1016/j.bmcl.2011.11.110
BindingDB Entry DOI: 10.7270/Q2XS5VVC