null
SMILES: Clc1cccc(n1)N1CCN(CC1)C(=O)CCNS(=O)(=O)c1cccc2nsnc12
InChI Key: InChIKey=BIDBQLHOJYJRFT-UHFFFAOYSA-N
Activity Spreadsheet -- Enzyme Inhibition Constant Data from BindingDB
Found 1 hit for monomerid = 50362374
Trg + Lig
Ki
nM
ΔG°
kcal/mole
IC50
nM
Kd
nM
EC50/IC50
nM
koff
s-1
kon
M-1s-1
pHTemp
°C
Muscarinic acetylcholine receptor M1
(Homo sapiens (Human))
BDBM50362374
(CHEMBL1939959)
Show SMILES Clc1cccc(n1)N1CCN(CC1)C(=O)CCNS(=O)(=O)c1cccc2nsnc12
Show InChI InChI=1S/C18H19ClN6O3S2/c19-15-5-2-6-16(21-15)24-9-11-25(12-10-24)17(26)7-8-20-30(27,28)14-4-1-3-13-18(14)23-29-22-13/h1-6,20H,7-12H2
n/an/a>1.00E+4n/an/an/an/an/an/a
Vanderbilt University Medical Center
Curated by ChEMBL
Assay Description
Antagonist activity at human muscarinic M1 receptor expressed in CHO cells assessed as inhibition of acetylcholine-induced calcium mobilization by fl...
Bioorg Med Chem Lett 22: 1044-8 (2012)
Article DOI: 10.1016/j.bmcl.2011.11.110
BindingDB Entry DOI: 10.7270/Q2XS5VVC