BDBM50362535 CHEMBL1941012
SMILES: O=C(Cn1c(nc2ccccc12)-c1ccccn1)c1ccccc1
InChI Key: InChIKey=HUKYIRBGIHBTTC-UHFFFAOYSA-N
Data: 2 IC50
Activity Spreadsheet -- Enzyme Inhibition Constant Data from BindingDB
Found 2 hits for monomerid = 50362535
Trg + Lig
Ki
nM
ΔG°
kcal/mole
IC50
nM
Kd
nM
EC50/IC50
nM
koff
s-1
kon
M-1s-1
pHTemp
°C
Cathepsin D
(Homo sapiens (Human))
BDBM50362535
(CHEMBL1941012)
Show SMILES O=C(Cn1c(nc2ccccc12)-c1ccccn1)c1ccccc1
Show InChI InChI=1S/C20H15N3O/c24-19(15-8-2-1-3-9-15)14-23-18-12-5-4-10-16(18)22-20(23)17-11-6-7-13-21-17/h1-13H,14H2
NCI pathway
Reactome pathway
n/an/a 3.92E+4n/an/an/an/an/an/a
University of Karachi
Curated by ChEMBL
Assay Description
Inhibition of human cathepsin D using DABCYL-Glu-Arg-Nle-Phe-Leu-Ser-Phe-Pro-EDANS as substrate by FRET analysis
Bioorg Med Chem Lett 22: 1282-6 (2012)
Article DOI: 10.1016/j.bmcl.2011.10.018
BindingDB Entry DOI: 10.7270/Q2WS8TPJ
Plasmepsin 2
(Plasmodium falciparum)
BDBM50362535
(CHEMBL1941012)
Show SMILES O=C(Cn1c(nc2ccccc12)-c1ccccn1)c1ccccc1
Show InChI InChI=1S/C20H15N3O/c24-19(15-8-2-1-3-9-15)14-23-18-12-5-4-10-16(18)22-20(23)17-11-6-7-13-21-17/h1-13H,14H2
n/an/a 1.00E+4n/an/an/an/an/an/a
University of Karachi
Curated by ChEMBL
Assay Description
Inhibition of Plasmodium falciparum plasmepsin-2 using DABCYL-Glu-Arg-Nle-Phe-Leu-Ser-Phe-Pro-EDANS as substrate by FRET analysis
Bioorg Med Chem Lett 22: 1282-6 (2012)
Article DOI: 10.1016/j.bmcl.2011.10.018
BindingDB Entry DOI: 10.7270/Q2WS8TPJ