BDBM50362537 CHEMBL1941014
SMILES: COc1ccc(cc1)C(=O)Cn1c(nc2ccccc12)-c1ccccn1
InChI Key: InChIKey=REQJJPAMXNTFPN-UHFFFAOYSA-N
Data: 2 IC50
Activity Spreadsheet -- Enzyme Inhibition Constant Data from BindingDB
Found 2 hits for monomerid = 50362537
Trg + Lig
Ki
nM
ΔG°
kcal/mole
IC50
nM
Kd
nM
EC50/IC50
nM
koff
s-1
kon
M-1s-1
pHTemp
°C
Cathepsin D
(Homo sapiens (Human))
BDBM50362537
(CHEMBL1941014)
Show SMILES COc1ccc(cc1)C(=O)Cn1c(nc2ccccc12)-c1ccccn1
Show InChI InChI=1S/C21H17N3O2/c1-26-16-11-9-15(10-12-16)20(25)14-24-19-8-3-2-6-17(19)23-21(24)18-7-4-5-13-22-18/h2-13H,14H2,1H3
NCI pathway
Reactome pathway
n/an/a 1.42E+4n/an/an/an/an/an/a
University of Karachi
Curated by ChEMBL
Assay Description
Inhibition of human cathepsin D using DABCYL-Glu-Arg-Nle-Phe-Leu-Ser-Phe-Pro-EDANS as substrate by FRET analysis
Bioorg Med Chem Lett 22: 1282-6 (2012)
Article DOI: 10.1016/j.bmcl.2011.10.018
BindingDB Entry DOI: 10.7270/Q2WS8TPJ
Plasmepsin 2
(Plasmodium falciparum)
BDBM50362537
(CHEMBL1941014)
Show SMILES COc1ccc(cc1)C(=O)Cn1c(nc2ccccc12)-c1ccccn1
Show InChI InChI=1S/C21H17N3O2/c1-26-16-11-9-15(10-12-16)20(25)14-24-19-8-3-2-6-17(19)23-21(24)18-7-4-5-13-22-18/h2-13H,14H2,1H3
n/an/a 3.77E+4n/an/an/an/an/an/a
University of Karachi
Curated by ChEMBL
Assay Description
Inhibition of Plasmodium falciparum plasmepsin-2 using DABCYL-Glu-Arg-Nle-Phe-Leu-Ser-Phe-Pro-EDANS as substrate by FRET analysis
Bioorg Med Chem Lett 22: 1282-6 (2012)
Article DOI: 10.1016/j.bmcl.2011.10.018
BindingDB Entry DOI: 10.7270/Q2WS8TPJ