BDBM50362538 CHEMBL1941015
SMILES: COc1ccc(OC)c(c1)C(=O)Cn1c(nc2ccccc12)-c1ccccn1
InChI Key: InChIKey=QQLKHPXVRFVHMI-UHFFFAOYSA-N
Data: 2 IC50
Activity Spreadsheet -- Enzyme Inhibition Constant Data from BindingDB
Found 2 hits for monomerid = 50362538
Trg + Lig
Ki
nM
ΔG°
kcal/mole
IC50
nM
Kd
nM
EC50/IC50
nM
koff
s-1
kon
M-1s-1
pHTemp
°C
Cathepsin D
(Homo sapiens (Human))
BDBM50362538
(CHEMBL1941015)
Show SMILES COc1ccc(OC)c(c1)C(=O)Cn1c(nc2ccccc12)-c1ccccn1
Show InChI InChI=1S/C22H19N3O3/c1-27-15-10-11-21(28-2)16(13-15)20(26)14-25-19-9-4-3-7-17(19)24-22(25)18-8-5-6-12-23-18/h3-13H,14H2,1-2H3
NCI pathway
Reactome pathway
n/an/a 2.12E+4n/an/an/an/an/an/a
University of Karachi
Curated by ChEMBL
Assay Description
Inhibition of human cathepsin D using DABCYL-Glu-Arg-Nle-Phe-Leu-Ser-Phe-Pro-EDANS as substrate by FRET analysis
Bioorg Med Chem Lett 22: 1282-6 (2012)
Article DOI: 10.1016/j.bmcl.2011.10.018
BindingDB Entry DOI: 10.7270/Q2WS8TPJ
Plasmepsin 2
(Plasmodium falciparum)
BDBM50362538
(CHEMBL1941015)
Show SMILES COc1ccc(OC)c(c1)C(=O)Cn1c(nc2ccccc12)-c1ccccn1
Show InChI InChI=1S/C22H19N3O3/c1-27-15-10-11-21(28-2)16(13-15)20(26)14-25-19-9-4-3-7-17(19)24-22(25)18-8-5-6-12-23-18/h3-13H,14H2,1-2H3
n/an/a 3.40E+4n/an/an/an/an/an/a
University of Karachi
Curated by ChEMBL
Assay Description
Inhibition of Plasmodium falciparum plasmepsin-2 using DABCYL-Glu-Arg-Nle-Phe-Leu-Ser-Phe-Pro-EDANS as substrate by FRET analysis
Bioorg Med Chem Lett 22: 1282-6 (2012)
Article DOI: 10.1016/j.bmcl.2011.10.018
BindingDB Entry DOI: 10.7270/Q2WS8TPJ