null
SMILES: CC(C)(C)c1ccc(CSc2nc(N)cc(=O)[nH]2)cc1
InChI Key: InChIKey=ASEDNWCJVUADNB-UHFFFAOYSA-N
Activity Spreadsheet -- Enzyme Inhibition Constant Data from BindingDB
Found 5 hits for monomerid = 50362567
Trg + Lig
Ki
nM
ΔG°
kcal/mole
IC50
nM
Kd
nM
EC50/IC50
nM
koff
s-1
kon
M-1s-1
pHTemp
°C
Potassium voltage-gated channel subfamily H member 2
(Homo sapiens (Human))
BDBM50362567
(CHEMBL1313991)
Show SMILES CC(C)(C)c1ccc(CSc2nc(N)cc(=O)[nH]2)cc1
Show InChI InChI=1S/C15H19N3OS/c1-15(2,3)11-6-4-10(5-7-11)9-20-14-17-12(16)8-13(19)18-14/h4-8H,9H2,1-3H3,(H3,16,17,18,19)
Reactome pathway
>1.50E+4n/an/an/an/an/an/an/an/a
Amgen Inc.
Curated by ChEMBL
Assay Description
Displacement of dofetilide from human ERG
Bioorg Med Chem Lett 22: 1055-60 (2012)
Article DOI: 10.1016/j.bmcl.2011.11.111
BindingDB Entry DOI: 10.7270/Q2CV4J7X
Sodium channel protein type 9 subunit alpha
(Homo sapiens (Human))
BDBM50362567
(CHEMBL1313991)
Show SMILES CC(C)(C)c1ccc(CSc2nc(N)cc(=O)[nH]2)cc1
Show InChI InChI=1S/C15H19N3OS/c1-15(2,3)11-6-4-10(5-7-11)9-20-14-17-12(16)8-13(19)18-14/h4-8H,9H2,1-3H3,(H3,16,17,18,19)
n/an/a 680n/an/an/an/an/an/a
Amgen Inc.
Curated by ChEMBL
Assay Description
Antagonist activity at 20% inactivated human sodium channel Nav1.7 expressed in human HEK293 cells by patch-clamp electrophysiological assay
Bioorg Med Chem Lett 22: 1055-60 (2012)
Article DOI: 10.1016/j.bmcl.2011.11.111
BindingDB Entry DOI: 10.7270/Q2CV4J7X
Sodium channel protein type 5 subunit alpha
(Homo sapiens (Human))
BDBM50362567
(CHEMBL1313991)
Show SMILES CC(C)(C)c1ccc(CSc2nc(N)cc(=O)[nH]2)cc1
Show InChI InChI=1S/C15H19N3OS/c1-15(2,3)11-6-4-10(5-7-11)9-20-14-17-12(16)8-13(19)18-14/h4-8H,9H2,1-3H3,(H3,16,17,18,19)
n/an/a 300n/an/an/an/an/an/a
Amgen Inc.
Curated by ChEMBL
Assay Description
Antagonist activity at partially inactivated human sodium channel Nav1.5 expressed in human HEK293 cells by patch-clamp electrophysiological assay
Bioorg Med Chem Lett 22: 1055-60 (2012)
Article DOI: 10.1016/j.bmcl.2011.11.111
BindingDB Entry DOI: 10.7270/Q2CV4J7X
Sodium channel protein type 9 subunit alpha
(Homo sapiens (Human))
BDBM50362567
(CHEMBL1313991)
Show SMILES CC(C)(C)c1ccc(CSc2nc(N)cc(=O)[nH]2)cc1
Show InChI InChI=1S/C15H19N3OS/c1-15(2,3)11-6-4-10(5-7-11)9-20-14-17-12(16)8-13(19)18-14/h4-8H,9H2,1-3H3,(H3,16,17,18,19)
n/an/a 340n/an/an/an/an/an/a
Amgen Inc.
Curated by ChEMBL
Assay Description
Antagonist activity at 20% inactivated human sodium channel Nav1.7 expressed in human HEK293 cells by manual patch-clamp electrophysiological assay
Bioorg Med Chem Lett 22: 1055-60 (2012)
Article DOI: 10.1016/j.bmcl.2011.11.111
BindingDB Entry DOI: 10.7270/Q2CV4J7X
Sodium channel protein type 9 subunit alpha
(Homo sapiens (Human))
BDBM50362567
(CHEMBL1313991)
Show SMILES CC(C)(C)c1ccc(CSc2nc(N)cc(=O)[nH]2)cc1
Show InChI InChI=1S/C15H19N3OS/c1-15(2,3)11-6-4-10(5-7-11)9-20-14-17-12(16)8-13(19)18-14/h4-8H,9H2,1-3H3,(H3,16,17,18,19)
n/an/a 2.20E+3n/an/an/an/an/an/a
Amgen Inc.
Curated by ChEMBL
Assay Description
Antagonist activity at non-inactivated human sodium channel Nav1.7 expressed in human HEK293 cells by manual patch-clamp electrophysiological assay
Bioorg Med Chem Lett 22: 1055-60 (2012)
Article DOI: 10.1016/j.bmcl.2011.11.111
BindingDB Entry DOI: 10.7270/Q2CV4J7X