BDBM50362778 CHEMBL1940182
SMILES: CCCc1cc2C(=O)c3c([nH]c4cc(ccc34)C#N)C(C)(C)c2cc1N1CCC(CC1)N1CCOCC1
InChI Key: InChIKey=RTXGTUWRJFXBLJ-UHFFFAOYSA-N
Data: 4 IC50
Activity Spreadsheet -- Enzyme Inhibition Constant Data from BindingDB
Found 4 hits for monomerid = 50362778
Trg + Lig
Ki
nM
ΔG°
kcal/mole
IC50
nM
Kd
nM
EC50/IC50
nM
koff
s-1
kon
M-1s-1
pHTemp
°C
Hepatocyte growth factor receptor
(Homo sapiens (Human))
BDBM50362778
(CHEMBL1940182)
Show SMILES CCCc1cc2C(=O)c3c([nH]c4cc(ccc34)C#N)C(C)(C)c2cc1N1CCC(CC1)N1CCOCC1
Show InChI InChI=1S/C31H36N4O2/c1-4-5-21-17-24-25(18-27(21)35-10-8-22(9-11-35)34-12-14-37-15-13-34)31(2,3)30-28(29(24)36)23-7-6-20(19-32)16-26(23)33-30/h6-7,16-18,22,33H,4-5,8-15H2,1-3H3
n/an/a>5.00E+3n/an/an/an/an/an/a
Chugai Pharmaceutical Co., Ltd
Curated by ChEMBL
Assay Description
Inhibition of MET using Bio-HER2tide as substrate by TR-FRET assay in presence of 50 uM of ATP
Bioorg Med Chem 20: 1271-80 (2012)
Article DOI: 10.1016/j.bmc.2011.12.021
BindingDB Entry DOI: 10.7270/Q23B60KW
ALK tyrosine kinase receptor
(Homo sapiens (Human))
BDBM50362778
(CHEMBL1940182)
Show SMILES CCCc1cc2C(=O)c3c([nH]c4cc(ccc34)C#N)C(C)(C)c2cc1N1CCC(CC1)N1CCOCC1
Show InChI InChI=1S/C31H36N4O2/c1-4-5-21-17-24-25(18-27(21)35-10-8-22(9-11-35)34-12-14-37-15-13-34)31(2,3)30-28(29(24)36)23-7-6-20(19-32)16-26(23)33-30/h6-7,16-18,22,33H,4-5,8-15H2,1-3H3
n/an/a 1.10n/an/an/an/an/an/a
Chugai Pharmaceutical Co., Ltd
Curated by ChEMBL
Assay Description
Inhibition of ALK using Bio-Gastrintide as substrate by TR-FRET assay in presence of 30 uM of ATP
Bioorg Med Chem 20: 1271-80 (2012)
Article DOI: 10.1016/j.bmc.2011.12.021
BindingDB Entry DOI: 10.7270/Q23B60KW
Vascular endothelial growth factor receptor 2
(Homo sapiens (Human))
BDBM50362778
(CHEMBL1940182)
Show SMILES CCCc1cc2C(=O)c3c([nH]c4cc(ccc34)C#N)C(C)(C)c2cc1N1CCC(CC1)N1CCOCC1
Show InChI InChI=1S/C31H36N4O2/c1-4-5-21-17-24-25(18-27(21)35-10-8-22(9-11-35)34-12-14-37-15-13-34)31(2,3)30-28(29(24)36)23-7-6-20(19-32)16-26(23)33-30/h6-7,16-18,22,33H,4-5,8-15H2,1-3H3
NCI pathway
Reactome pathway
n/an/a>5.00E+3n/an/an/an/an/an/a
Chugai Pharmaceutical Co., Ltd
Curated by ChEMBL
Assay Description
Inhibition of KDR using Bio-Gastrintide as substrate by TR-FRET assay in presence of 50 uM of ATP
Bioorg Med Chem 20: 1271-80 (2012)
Article DOI: 10.1016/j.bmc.2011.12.021
BindingDB Entry DOI: 10.7270/Q23B60KW
Mast/stem cell growth factor receptor Kit
(Homo sapiens (Human))
BDBM50362778
(CHEMBL1940182)
Show SMILES CCCc1cc2C(=O)c3c([nH]c4cc(ccc34)C#N)C(C)(C)c2cc1N1CCC(CC1)N1CCOCC1
Show InChI InChI=1S/C31H36N4O2/c1-4-5-21-17-24-25(18-27(21)35-10-8-22(9-11-35)34-12-14-37-15-13-34)31(2,3)30-28(29(24)36)23-7-6-20(19-32)16-26(23)33-30/h6-7,16-18,22,33H,4-5,8-15H2,1-3H3
n/an/a>5.00E+3n/an/an/an/an/an/a
Chugai Pharmaceutical Co., Ltd
Curated by ChEMBL
Assay Description
Inhibition of KIT using Bio-HER2tide as substrate by TR-FRET assay in presence of 50 uM of ATP
Bioorg Med Chem 20: 1271-80 (2012)
Article DOI: 10.1016/j.bmc.2011.12.021
BindingDB Entry DOI: 10.7270/Q23B60KW