BDBM50362979 CHEMBL1945173
SMILES: COc1ccc(CCCN(C)C)cc1Nc1ncc2CC(=S)Nc3cc(Cl)ccc3-c2n1
InChI Key: InChIKey=JQRWYCWILFBHJT-UHFFFAOYSA-N
Data: 6 IC50
Activity Spreadsheet -- Enzyme Inhibition Constant Data from BindingDB
Found 6 hits for monomerid = 50362979
Trg + Lig
Ki
nM
ΔG°
kcal/mole
IC50
nM
Kd
nM
EC50/IC50
nM
koff
s-1
kon
M-1s-1
pHTemp
°C
Mast/stem cell growth factor receptor Kit
(Homo sapiens (Human))
BDBM50362979
(CHEMBL1945173)
Show SMILES COc1ccc(CCCN(C)C)cc1Nc1ncc2CC(=S)Nc3cc(Cl)ccc3-c2n1
Show InChI InChI=1S/C24H26ClN5OS/c1-30(2)10-4-5-15-6-9-21(31-3)20(11-15)28-24-26-14-16-12-22(32)27-19-13-17(25)7-8-18(19)23(16)29-24/h6-9,11,13-14H,4-5,10,12H2,1-3H3,(H,27,32)(H,26,28,29)
n/an/a 1.10E+3n/an/an/an/an/an/a
Millennium Pharmaceuticals, Inc.
Curated by ChEMBL
Assay Description
Inhibition of KIT
J Med Chem 55: 197-208 (2012)
Article DOI: 10.1021/jm2011172
BindingDB Entry DOI: 10.7270/Q21C1XBR
Fibroblast growth factor receptor 1
(Homo sapiens (Human))
BDBM50362979
(CHEMBL1945173)
Show SMILES COc1ccc(CCCN(C)C)cc1Nc1ncc2CC(=S)Nc3cc(Cl)ccc3-c2n1
Show InChI InChI=1S/C24H26ClN5OS/c1-30(2)10-4-5-15-6-9-21(31-3)20(11-15)28-24-26-14-16-12-22(32)27-19-13-17(25)7-8-18(19)23(16)29-24/h6-9,11,13-14H,4-5,10,12H2,1-3H3,(H,27,32)(H,26,28,29)
NCI pathway
Reactome pathway
n/an/a 1.00E+3n/an/an/an/an/an/a
Millennium Pharmaceuticals, Inc.
Curated by ChEMBL
Assay Description
Inhibition of FGFR1
J Med Chem 55: 197-208 (2012)
Article DOI: 10.1021/jm2011172
BindingDB Entry DOI: 10.7270/Q21C1XBR
Serine/threonine-protein kinase PLK3
(Homo sapiens (Human))
BDBM50362979
(CHEMBL1945173)
Show SMILES COc1ccc(CCCN(C)C)cc1Nc1ncc2CC(=S)Nc3cc(Cl)ccc3-c2n1
Show InChI InChI=1S/C24H26ClN5OS/c1-30(2)10-4-5-15-6-9-21(31-3)20(11-15)28-24-26-14-16-12-22(32)27-19-13-17(25)7-8-18(19)23(16)29-24/h6-9,11,13-14H,4-5,10,12H2,1-3H3,(H,27,32)(H,26,28,29)
NCI pathway
n/an/a 140n/an/an/an/an/an/a
Millennium Pharmaceuticals, Inc.
Curated by ChEMBL
Assay Description
Inhibition of PLK3
J Med Chem 55: 197-208 (2012)
Article DOI: 10.1021/jm2011172
BindingDB Entry DOI: 10.7270/Q21C1XBR
Platelet-derived growth factor receptor beta
(Homo sapiens (Human))
BDBM50362979
(CHEMBL1945173)
Show SMILES COc1ccc(CCCN(C)C)cc1Nc1ncc2CC(=S)Nc3cc(Cl)ccc3-c2n1
Show InChI InChI=1S/C24H26ClN5OS/c1-30(2)10-4-5-15-6-9-21(31-3)20(11-15)28-24-26-14-16-12-22(32)27-19-13-17(25)7-8-18(19)23(16)29-24/h6-9,11,13-14H,4-5,10,12H2,1-3H3,(H,27,32)(H,26,28,29)
NCI pathway
Reactome pathway
n/an/a 190n/an/an/an/an/an/a
Millennium Pharmaceuticals, Inc.
Curated by ChEMBL
Assay Description
Inhibition of PDGFRb
J Med Chem 55: 197-208 (2012)
Article DOI: 10.1021/jm2011172
BindingDB Entry DOI: 10.7270/Q21C1XBR
Vascular endothelial growth factor receptor 2
(Homo sapiens (Human))
BDBM50362979
(CHEMBL1945173)
Show SMILES COc1ccc(CCCN(C)C)cc1Nc1ncc2CC(=S)Nc3cc(Cl)ccc3-c2n1
Show InChI InChI=1S/C24H26ClN5OS/c1-30(2)10-4-5-15-6-9-21(31-3)20(11-15)28-24-26-14-16-12-22(32)27-19-13-17(25)7-8-18(19)23(16)29-24/h6-9,11,13-14H,4-5,10,12H2,1-3H3,(H,27,32)(H,26,28,29)
NCI pathway
Reactome pathway
n/an/a 54n/an/an/an/an/an/a
Millennium Pharmaceuticals, Inc.
Curated by ChEMBL
Assay Description
Inhibition of KDR
J Med Chem 55: 197-208 (2012)
Article DOI: 10.1021/jm2011172
BindingDB Entry DOI: 10.7270/Q21C1XBR
Receptor-type tyrosine-protein kinase FLT3
(Homo sapiens (Human))
BDBM50362979
(CHEMBL1945173)
Show SMILES COc1ccc(CCCN(C)C)cc1Nc1ncc2CC(=S)Nc3cc(Cl)ccc3-c2n1
Show InChI InChI=1S/C24H26ClN5OS/c1-30(2)10-4-5-15-6-9-21(31-3)20(11-15)28-24-26-14-16-12-22(32)27-19-13-17(25)7-8-18(19)23(16)29-24/h6-9,11,13-14H,4-5,10,12H2,1-3H3,(H,27,32)(H,26,28,29)
n/an/a 590n/an/an/an/an/an/a
Millennium Pharmaceuticals, Inc.
Curated by ChEMBL
Assay Description
Inhibition of FLT3
J Med Chem 55: 197-208 (2012)
Article DOI: 10.1021/jm2011172
BindingDB Entry DOI: 10.7270/Q21C1XBR