BDBM50363009 CHEMBL1946412
SMILES: CC(C)NC1=Nc2cc(Br)ccc2S(=O)(=O)N1
InChI Key: InChIKey=ZYLQEDAWLNESON-UHFFFAOYSA-N
Data: 1 IC50
Activity Spreadsheet -- Enzyme Inhibition Constant Data from BindingDB
Found 1 hit for monomerid = 50363009
Trg + Lig
Ki
nM
ΔG°
kcal/mole
IC50
nM
Kd
nM
EC50/IC50
nM
koff
s-1
kon
M-1s-1
pHTemp
°C
ATP-binding cassette sub-family C member 8
(Rattus norvegicus)
BDBM50363009
(CHEMBL1946412)
Show SMILES CC(C)NC1=Nc2cc(Br)ccc2S(=O)(=O)N1 |t:4|
Show InChI InChI=1S/C10H12BrN3O2S/c1-6(2)12-10-13-8-5-7(11)3-4-9(8)17(15,16)14-10/h3-6H,1-2H3,(H2,12,13,14)
n/an/a 200n/an/an/an/an/an/a
Universit£ de Li£ge
Curated by ChEMBL
Assay Description
Activation of SUR1 in rat pancreatic islets assessed as inhibition of glucose-induced insulin secretion
J Med Chem 54: 8353-61 (2011)
Article DOI: 10.1021/jm200786z
BindingDB Entry DOI: 10.7270/Q2WQ047Q