BDBM50363184 CHEMBL1946586
SMILES: [#6]\[#6](-[#6])=[#6]\[#6]-[#6]\[#6](-[#6])=[#6]\[#6]-[#6]\[#6](-[#6])=[#6]\[#6]-[#16]-[#6]-[#6@H](-[#7]-[#6](=O)-c1cccc(-[#8]-c2ccccc2)c1)-[#6](-[#8])=O
InChI Key: InChIKey=ICTLZGMOBMLQDQ-IVECXGJCSA-N
Data: 1 IC50
Activity Spreadsheet -- Enzyme Inhibition Constant Data from BindingDB
Found 1 hit for monomerid = 50363184
Trg + Lig
Ki
nM
ΔG°
kcal/mole
IC50
nM
Kd
nM
EC50/IC50
nM
koff
s-1
kon
M-1s-1
pHTemp
°C
Protein-S-isoprenylcysteine O-methyltransferase
(Homo sapiens (Human))
BDBM50363184
(CHEMBL1946586)
Show SMILES [#6]\[#6](-[#6])=[#6]\[#6]-[#6]\[#6](-[#6])=[#6]\[#6]-[#6]\[#6](-[#6])=[#6]\[#6]-[#16]-[#6]-[#6@H](-[#7]-[#6](=O)-c1cccc(-[#8]-c2ccccc2)c1)-[#6](-[#8])=O |r|
Show InChI InChI=1S/C31H39NO4S/c1-23(2)11-8-12-24(3)13-9-14-25(4)19-20-37-22-29(31(34)35)32-30(33)26-15-10-18-28(21-26)36-27-16-6-5-7-17-27/h5-7,10-11,13,15-19,21,29H,8-9,12,14,20,22H2,1-4H3,(H,32,33)(H,34,35)/b24-13+,25-19+/t29-/m0/s1
n/an/a 2.26E+4n/an/an/an/an/an/a
Purdue University
Curated by ChEMBL
Assay Description
Inhibition of His-tagged human Icmt membrane protein over-expressed in Saccharomyces cerevisiae 2766 using [14C]-SAM and N-acetyl-S-farnesyl-l-cystei...
Bioorg Med Chem 20: 283-95 (2011)
Article DOI: 10.1016/j.bmc.2011.10.087
BindingDB Entry DOI: 10.7270/Q2QZ2BD2