null
SMILES: CCCCCCCCCCCSC[C@H](NC(=O)c1ccccc1Oc1ccccc1)C(O)=O
InChI Key: InChIKey=HOARIQXXZSTJHN-DEOSSOPVSA-N
Activity Spreadsheet -- Enzyme Inhibition Constant Data from BindingDB
Found 1 hit for monomerid = 50363195
Trg + Lig
Ki
nM
ΔG°
kcal/mole
IC50
nM
Kd
nM
EC50/IC50
nM
koff
s-1
kon
M-1s-1
pHTemp
°C
Protein-S-isoprenylcysteine O-methyltransferase
(Homo sapiens (Human))
BDBM50363195
(CHEMBL1946776)
Show SMILES CCCCCCCCCCCSC[C@H](NC(=O)c1ccccc1Oc1ccccc1)C(O)=O |r|
Show InChI InChI=1S/C27H37NO4S/c1-2-3-4-5-6-7-8-9-15-20-33-21-24(27(30)31)28-26(29)23-18-13-14-19-25(23)32-22-16-11-10-12-17-22/h10-14,16-19,24H,2-9,15,20-21H2,1H3,(H,28,29)(H,30,31)/t24-/m0/s1
n/an/a 2.10E+5n/an/an/an/an/an/a
Purdue University
Curated by ChEMBL
Assay Description
Inhibition of His-tagged human Icmt membrane protein over-expressed in Saccharomyces cerevisiae 2766 using [14C]-SAM and N-acetyl-S-farnesyl-l-cystei...
Bioorg Med Chem 20: 283-95 (2011)
Article DOI: 10.1016/j.bmc.2011.10.087
BindingDB Entry DOI: 10.7270/Q2QZ2BD2