BDBM50363277 CHEMBL1945066
SMILES: Cn1ncc2c(ncnc12)N(Cc1cc(=O)[nH]c2c(F)c(F)ccc12)c1cccc(Cl)c1
InChI Key: InChIKey=FVSIJTPSJWTFGY-UHFFFAOYSA-N
Data: 3 IC50
Activity Spreadsheet -- Enzyme Inhibition Constant Data from BindingDB
Found 3 hits for monomerid = 50363277
Trg + Lig
Ki
nM
ΔG°
kcal/mole
IC50
nM
Kd
nM
EC50/IC50
nM
koff
s-1
kon
M-1s-1
pHTemp
°C
Nitric oxide synthase, endothelial
(Homo sapiens (Human))
BDBM50363277
(CHEMBL1945066)
Show SMILES Cn1ncc2c(ncnc12)N(Cc1cc(=O)[nH]c2c(F)c(F)ccc12)c1cccc(Cl)c1
Show InChI InChI=1S/C22H15ClF2N6O/c1-30-21-16(9-28-30)22(27-11-26-21)31(14-4-2-3-13(23)8-14)10-12-7-18(32)29-20-15(12)5-6-17(24)19(20)25/h2-9,11H,10H2,1H3,(H,29,32)
n/an/a 8.30E+3n/an/an/an/an/an/a
Afraxis
Curated by ChEMBL
Assay Description
Inhibition of human eNOS expressed in HEK293 cells assessed as NO production by 2,3-diaminonapthalene-based fluorescence assay
Bioorg Med Chem Lett 22: 1237-41 (2012)
Article DOI: 10.1016/j.bmcl.2011.11.073
BindingDB Entry DOI: 10.7270/Q26W9BJ5
Nitric oxide synthase, inducible
(Homo sapiens (Human))
BDBM50363277
(CHEMBL1945066)
Show SMILES Cn1ncc2c(ncnc12)N(Cc1cc(=O)[nH]c2c(F)c(F)ccc12)c1cccc(Cl)c1
Show InChI InChI=1S/C22H15ClF2N6O/c1-30-21-16(9-28-30)22(27-11-26-21)31(14-4-2-3-13(23)8-14)10-12-7-18(32)29-20-15(12)5-6-17(24)19(20)25/h2-9,11H,10H2,1H3,(H,29,32)
NCI pathway
Reactome pathway
n/an/a 11n/an/an/an/an/an/a
Afraxis
Curated by ChEMBL
Assay Description
Inhibition of human iNOS expressed in HEK293 cells assessed as NO production by 2,3-diaminonapthalene-based fluorescence assay
Bioorg Med Chem Lett 22: 1237-41 (2012)
Article DOI: 10.1016/j.bmcl.2011.11.073
BindingDB Entry DOI: 10.7270/Q26W9BJ5
Nitric oxide synthase, brain
(Homo sapiens (Human))
BDBM50363277
(CHEMBL1945066)
Show SMILES Cn1ncc2c(ncnc12)N(Cc1cc(=O)[nH]c2c(F)c(F)ccc12)c1cccc(Cl)c1
Show InChI InChI=1S/C22H15ClF2N6O/c1-30-21-16(9-28-30)22(27-11-26-21)31(14-4-2-3-13(23)8-14)10-12-7-18(32)29-20-15(12)5-6-17(24)19(20)25/h2-9,11H,10H2,1H3,(H,29,32)
Reactome pathway
n/an/a 62n/an/an/an/an/an/a
Afraxis
Curated by ChEMBL
Assay Description
Inhibition of human nNOS expressed in HEK293 cells assessed as NO production by 2,3-diaminonapthalene-based fluorescence assay
Bioorg Med Chem Lett 22: 1237-41 (2012)
Article DOI: 10.1016/j.bmcl.2011.11.073
BindingDB Entry DOI: 10.7270/Q26W9BJ5