null
SMILES: [#6]-[#7]-1-[#6]-[#6]-[#7](-[#6]-[#6]-1)-[#6](=O)-c1ccc(cc1)-[#6](=[#6]-1/[#6]-[#6]-[#7](-[#6]-c2cscn2)-[#6]-[#6]-1)\c1cccc2cccnc12
InChI Key: InChIKey=WZEKVKYZWVQTGZ-UHFFFAOYSA-N
Activity Spreadsheet -- Enzyme Inhibition Constant Data from BindingDB
Found 2 hits for monomerid = 50363346
Trg + Lig
Ki
nM
ΔG°
kcal/mole
IC50
nM
Kd
nM
EC50/IC50
nM
koff
s-1
kon
M-1s-1
pHTemp
°C
Mu-type opioid receptor
(Homo sapiens (Human))
BDBM50363346
(CHEMBL1946616)
Show SMILES [#6]-[#7]-1-[#6]-[#6]-[#7](-[#6]-[#6]-1)-[#6](=O)-c1ccc(cc1)-[#6](=[#6]-1/[#6]-[#6]-[#7](-[#6]-c2cscn2)-[#6]-[#6]-1)\c1cccc2cccnc12
Show InChI InChI=1S/C31H33N5OS/c1-34-16-18-36(19-17-34)31(37)26-9-7-23(8-10-26)29(28-6-2-4-25-5-3-13-32-30(25)28)24-11-14-35(15-12-24)20-27-21-38-22-33-27/h2-10,13,21-22H,11-12,14-20H2,1H3
NCI pathway
Reactome pathway
n/an/a 200n/an/an/an/an/an/a
AstraZeneca Pharmaceuticals
Curated by ChEMBL
Assay Description
Displacement of radiolabeled FK33-824 from mu opioid receptor expressed in HEK293 cell membranes
Bioorg Med Chem Lett 22: 1174-8 (2012)
Article DOI: 10.1016/j.bmcl.2011.11.089
BindingDB Entry DOI: 10.7270/Q2FF3STJ
Delta-type opioid receptor
(Homo sapiens (Human))
BDBM50363346
(CHEMBL1946616)
Show SMILES [#6]-[#7]-1-[#6]-[#6]-[#7](-[#6]-[#6]-1)-[#6](=O)-c1ccc(cc1)-[#6](=[#6]-1/[#6]-[#6]-[#7](-[#6]-c2cscn2)-[#6]-[#6]-1)\c1cccc2cccnc12
Show InChI InChI=1S/C31H33N5OS/c1-34-16-18-36(19-17-34)31(37)26-9-7-23(8-10-26)29(28-6-2-4-25-5-3-13-32-30(25)28)24-11-14-35(15-12-24)20-27-21-38-22-33-27/h2-10,13,21-22H,11-12,14-20H2,1H3
Reactome pathway
n/an/a 3.40n/an/an/an/an/an/a
AstraZeneca Pharmaceuticals
Curated by ChEMBL
Assay Description
Displacement of radiolabeled iodinated deltorphin 2 from delta opioid receptor expressed in HEK293 cell membranes
Bioorg Med Chem Lett 22: 1174-8 (2012)
Article DOI: 10.1016/j.bmcl.2011.11.089
BindingDB Entry DOI: 10.7270/Q2FF3STJ