BDBM50363879 CHEMBL1947269
SMILES: COC(=O)c1ccc(cc1)C(=O)NC(=O)N[C@@H]1O[C@H](CO)[C@@H](O)[C@H](O)[C@H]1O
InChI Key: InChIKey=RDCDSHXCGVLPKR-YGEZULPYSA-N
Data: 1 KI
Activity Spreadsheet -- Enzyme Inhibition Constant Data from BindingDB
Found 1 hit for monomerid = 50363879
Trg + Lig
Ki
nM
ΔG°
kcal/mole
IC50
nM
Kd
nM
EC50/IC50
nM
koff
s-1
kon
M-1s-1
pHTemp
°C
Glycogen phosphorylase, muscle form
(Oryctolagus cuniculus (rabbit))
BDBM50363879
(CHEMBL1947269)
Show SMILES COC(=O)c1ccc(cc1)C(=O)NC(=O)N[C@@H]1O[C@H](CO)[C@@H](O)[C@H](O)[C@H]1O |r|
Show InChI InChI=1S/C16H20N2O9/c1-26-15(24)8-4-2-7(3-5-8)13(23)17-16(25)18-14-12(22)11(21)10(20)9(6-19)27-14/h2-5,9-12,14,19-22H,6H2,1H3,(H2,17,18,23,25)/t9-,10-,11+,12-,14-/m1/s1
4.00E+3n/an/an/an/an/an/a6.8n/a
University of Debrecen
Curated by ChEMBL
Assay Description
Inhibition of rabbit muscle glycogen phosphorylase b assessed as inorganic phosphate release at pH 6.8
Bioorg Med Chem 20: 1801-16 (2012)
Article DOI: 10.1016/j.bmc.2011.12.059
BindingDB Entry DOI: 10.7270/Q2SN09DD