BDBM50363882 CHEMBL1944838
SMILES: Cn1c2ccn(CC(=O)Nc3ccc(cc3)C(F)(F)F)c2c(=O)n(C)c1=O
InChI Key: InChIKey=XTJCMZFNEXELMO-UHFFFAOYSA-N
Data: 2 IC50
Activity Spreadsheet -- Enzyme Inhibition Constant Data from BindingDB
Found 2 hits for monomerid = 50363882
Trg + Lig
Ki
nM
ΔG°
kcal/mole
IC50
nM
Kd
nM
EC50/IC50
nM
koff
s-1
kon
M-1s-1
pHTemp
°C
Transient receptor potential cation channel subfamily A member 1
(Rattus norvegicus)
BDBM50363882
(CHEMBL1944838)
Show SMILES Cn1c2ccn(CC(=O)Nc3ccc(cc3)C(F)(F)F)c2c(=O)n(C)c1=O
Show InChI InChI=1S/C17H15F3N4O3/c1-22-12-7-8-24(14(12)15(26)23(2)16(22)27)9-13(25)21-11-5-3-10(4-6-11)17(18,19)20/h3-8H,9H2,1-2H3,(H,21,25)
n/an/a 2.80E+3n/an/an/an/an/an/a
University of Ferrara
Curated by ChEMBL
Assay Description
Antagonist activity at Sprague-Dawley rat TRPA1 expressed in rat DRG neurons assessed as inhibition of acrolein-induced calcium influx after 40 mins ...
Bioorg Med Chem 20: 1690-8 (2012)
Article DOI: 10.1016/j.bmc.2012.01.020
BindingDB Entry DOI: 10.7270/Q2NV9JQK
Transient receptor potential cation channel subfamily A member 1
(Homo sapiens (Human))
BDBM50363882
(CHEMBL1944838)
Show SMILES Cn1c2ccn(CC(=O)Nc3ccc(cc3)C(F)(F)F)c2c(=O)n(C)c1=O
Show InChI InChI=1S/C17H15F3N4O3/c1-22-12-7-8-24(14(12)15(26)23(2)16(22)27)9-13(25)21-11-5-3-10(4-6-11)17(18,19)20/h3-8H,9H2,1-2H3,(H,21,25)
n/an/a 400n/an/an/an/an/an/a
University of Ferrara
Curated by ChEMBL
Assay Description
Antagonist activity at human TRPA1 expressed in human IMR90 cells assessed as inhibition of acrolein-induced calcium influx after 40 mins by fluoresc...
Bioorg Med Chem 20: 1690-8 (2012)
Article DOI: 10.1016/j.bmc.2012.01.020
BindingDB Entry DOI: 10.7270/Q2NV9JQK