BDBM50363890 CHEMBL1945689
SMILES: Cn1c2ccn(CC(=O)Nc3nc(cs3)-c3ccc(F)cc3)c2c(=O)n(C)c1=O
InChI Key: InChIKey=XXAJTWFMFVVGIN-UHFFFAOYSA-N
Data: 1 IC50
Activity Spreadsheet -- Enzyme Inhibition Constant Data from BindingDB
Found 1 hit for monomerid = 50363890
Trg + Lig
Ki
nM
ΔG°
kcal/mole
IC50
nM
Kd
nM
EC50/IC50
nM
koff
s-1
kon
M-1s-1
pHTemp
°C
Transient receptor potential cation channel subfamily A member 1
(Homo sapiens (Human))
BDBM50363890
(CHEMBL1945689)
Show SMILES Cn1c2ccn(CC(=O)Nc3nc(cs3)-c3ccc(F)cc3)c2c(=O)n(C)c1=O
Show InChI InChI=1S/C19H16FN5O3S/c1-23-14-7-8-25(16(14)17(27)24(2)19(23)28)9-15(26)22-18-21-13(10-29-18)11-3-5-12(20)6-4-11/h3-8,10H,9H2,1-2H3,(H,21,22,26)
n/an/a 4.10E+3n/an/an/an/an/an/a
University of Ferrara
Curated by ChEMBL
Assay Description
Antagonist activity at human TRPA1 expressed in human IMR90 cells assessed as inhibition of acrolein-induced calcium influx after 40 mins by fluoresc...
Bioorg Med Chem 20: 1690-8 (2012)
Article DOI: 10.1016/j.bmc.2012.01.020
BindingDB Entry DOI: 10.7270/Q2NV9JQK