BDBM50363923 CHEMBL1951570
SMILES: COc1cc(CC(O)=O)ccc1Oc1ccc(cc1NS(=O)(=O)c1ccc(cc1Cl)C(F)(F)F)C(=O)NC1CCC1
InChI Key: InChIKey=KBLSMGVSEBPDRB-UHFFFAOYSA-N
Data: 4 IC50
Activity Spreadsheet -- Enzyme Inhibition Constant Data from BindingDB
Found 4 hits for monomerid = 50363923
Trg + Lig
Ki
nM
ΔG°
kcal/mole
IC50
nM
Kd
nM
EC50/IC50
nM
koff
s-1
kon
M-1s-1
pHTemp
°C
G protein-coupled receptor 44
(Homo sapiens (Human))
BDBM50363923
(CHEMBL1951570)
Show SMILES COc1cc(CC(O)=O)ccc1Oc1ccc(cc1NS(=O)(=O)c1ccc(cc1Cl)C(F)(F)F)C(=O)NC1CCC1
Show InChI InChI=1S/C27H24ClF3N2O7S/c1-39-23-11-15(12-25(34)35)5-8-22(23)40-21-9-6-16(26(36)32-18-3-2-4-18)13-20(21)33-41(37,38)24-10-7-17(14-19(24)28)27(29,30)31/h5-11,13-14,18,33H,2-4,12H2,1H3,(H,32,36)(H,34,35)
Reactome pathway
n/an/a 13n/an/an/an/an/an/a
TBA
Curated by ChEMBL
Assay Description
Displacement of [3H]-PGD2 from human CRTH2 receptor expressed in human HEK293 cells by scintillation counter in presence of 50% human plasma
ACS Med Chem Lett 2: 326-330 (2011)
Article DOI: 10.1021/ml1002234
BindingDB Entry DOI: 10.7270/Q28K79JH
Prostanoid DP receptor
(Homo sapiens (Human))
BDBM50363923
(CHEMBL1951570)
Show SMILES COc1cc(CC(O)=O)ccc1Oc1ccc(cc1NS(=O)(=O)c1ccc(cc1Cl)C(F)(F)F)C(=O)NC1CCC1
Show InChI InChI=1S/C27H24ClF3N2O7S/c1-39-23-11-15(12-25(34)35)5-8-22(23)40-21-9-6-16(26(36)32-18-3-2-4-18)13-20(21)33-41(37,38)24-10-7-17(14-19(24)28)27(29,30)31/h5-11,13-14,18,33H,2-4,12H2,1H3,(H,32,36)(H,34,35)
n/an/a 45n/an/an/an/an/an/a
TBA
Curated by ChEMBL
Assay Description
Displacement of [3H]-PGD2 from human Prostanoid DP receptor expressed in human HEK293 cells by scintillation counter in presence of 0.5% bovine serum...
ACS Med Chem Lett 2: 326-330 (2011)
Article DOI: 10.1021/ml1002234
BindingDB Entry DOI: 10.7270/Q28K79JH
Prostanoid DP receptor
(Homo sapiens (Human))
BDBM50363923
(CHEMBL1951570)
Show SMILES COc1cc(CC(O)=O)ccc1Oc1ccc(cc1NS(=O)(=O)c1ccc(cc1Cl)C(F)(F)F)C(=O)NC1CCC1
Show InChI InChI=1S/C27H24ClF3N2O7S/c1-39-23-11-15(12-25(34)35)5-8-22(23)40-21-9-6-16(26(36)32-18-3-2-4-18)13-20(21)33-41(37,38)24-10-7-17(14-19(24)28)27(29,30)31/h5-11,13-14,18,33H,2-4,12H2,1H3,(H,32,36)(H,34,35)
n/an/a 13n/an/an/an/an/an/a
TBA
Curated by ChEMBL
Assay Description
Displacement of [3H]-PGD2 from human Prostanoid DP receptor expressed in human HEK293 cells by scintillation counter in presence of 0.5% bovine serum...
ACS Med Chem Lett 2: 326-330 (2011)
Article DOI: 10.1021/ml1002234
BindingDB Entry DOI: 10.7270/Q28K79JH
G protein-coupled receptor 44
(Homo sapiens (Human))
BDBM50363923
(CHEMBL1951570)
Show SMILES COc1cc(CC(O)=O)ccc1Oc1ccc(cc1NS(=O)(=O)c1ccc(cc1Cl)C(F)(F)F)C(=O)NC1CCC1
Show InChI InChI=1S/C27H24ClF3N2O7S/c1-39-23-11-15(12-25(34)35)5-8-22(23)40-21-9-6-16(26(36)32-18-3-2-4-18)13-20(21)33-41(37,38)24-10-7-17(14-19(24)28)27(29,30)31/h5-11,13-14,18,33H,2-4,12H2,1H3,(H,32,36)(H,34,35)
Reactome pathway
n/an/a 4n/an/an/an/an/an/a
TBA
Curated by ChEMBL
Assay Description
Displacement of [3H]-PGD2 from human CRTH2 receptor expressed in human HEK293 cells by scintillation counter in presence of 0.5% bovine serum albumin
ACS Med Chem Lett 2: 326-330 (2011)
Article DOI: 10.1021/ml1002234
BindingDB Entry DOI: 10.7270/Q28K79JH