BDBM50363973 CHEMBL1949738
SMILES: [#6]-[#7]-1-[#6@H](-[#6]-[#6]-[#6]-[#7]-[#6](=O)-[#6]-[#6]-[#6]-[#6]-[#6]-[#6]-[#6](=O)-[#7]-[#6]-[#6]-[#6]-[#6@H]-2-[#7](-[#6])-[#6](=O)-[#6@@H](-[#6]-c3ccc(-[#8])cc3)-[#7]-[#6](=O)-[#6]-[#7]-[#6](=O)-[#6@H](-[#6]-c3ccc4ccccc4c3)-[#7]-[#6](=O)-[#6@H](-[#6]-[#6]-[#6]\[#7]=[#6](\[#7])-[#7])-[#7]-[#6]-2=O)-[#6](=O)-[#7]-[#6@@H](-[#6]-[#6]-[#6]\[#7]=[#6](\[#7])-[#7])-[#6](=O)-[#7]-[#6@@H](-[#6]-c2ccc3ccccc3c2)-[#6](=O)-[#7]-[#6]-[#6](=O)-[#7]-[#6@H](-[#6]-c2ccc(-[#8])cc2)-[#6]-1=O
InChI Key: InChIKey=DRXJZXSTLIPEPY-AXYRKMPXSA-N
Data: 1 IC50
Activity Spreadsheet -- Enzyme Inhibition Constant Data from BindingDB
Found 1 hit for monomerid = 50363973
Trg + Lig
Ki
nM
ΔG°
kcal/mole
IC50
nM
Kd
nM
EC50/IC50
nM
koff
s-1
kon
M-1s-1
pHTemp
°C
C-X-C chemokine receptor type 4 (CXCR4)
(Homo sapiens (Human))
BDBM50363973
(CHEMBL1949738)
Show SMILES [#6]-[#7]-1-[#6@H](-[#6]-[#6]-[#6]-[#7]-[#6](=O)-[#6]-[#6]-[#6]-[#6]-[#6]-[#6]-[#6](=O)-[#7]-[#6]-[#6]-[#6]-[#6@H]-2-[#7](-[#6])-[#6](=O)-[#6@@H](-[#6]-c3ccc(-[#8])cc3)-[#7]-[#6](=O)-[#6]-[#7]-[#6](=O)-[#6@H](-[#6]-c3ccc4ccccc4c3)-[#7]-[#6](=O)-[#6@H](-[#6]-[#6]-[#6]\[#7]=[#6](\[#7])-[#7])-[#7]-[#6]-2=O)-[#6](=O)-[#7]-[#6@@H](-[#6]-[#6]-[#6]\[#7]=[#6](\[#7])-[#7])-[#6](=O)-[#7]-[#6@@H](-[#6]-c2ccc3ccccc3c2)-[#6](=O)-[#7]-[#6]-[#6](=O)-[#7]-[#6@H](-[#6]-c2ccc(-[#8])cc2)-[#6]-1=O |r|
Show InChI InChI=1S/C80H104N18O14/c1-97-65(75(109)93-59(19-11-39-87-79(81)82)73(107)95-61(45-51-25-31-53-15-7-9-17-55(53)41-51)71(105)89-47-69(103)91-63(77(97)111)43-49-27-33-57(99)34-28-49)21-13-37-85-67(101)23-5-3-4-6-24-68(102)86-38-14-22-66-76(110)94-60(20-12-40-88-80(83)84)74(108)96-62(46-52-26-32-54-16-8-10-18-56(54)42-52)72(106)90-48-70(104)92-64(78(112)98(66)2)44-50-29-35-58(100)36-30-50/h7-10,15-18,25-36,41-42,59-66,99-100H,3-6,11-14,19-24,37-40,43-48H2,1-2H3,(H,85,101)(H,86,102)(H,89,105)(H,90,106)(H,91,103)(H,92,104)(H,93,109)(H,94,110)(H,95,107)(H,96,108)(H4,81,82,87)(H4,83,84,88)/t59-,60-,61-,62-,63+,64+,65+,66+/m0/s1
n/an/a 3n/an/an/an/an/an/a
Technische Universit£t M£nchen
Curated by ChEMBL
Assay Description
Displacement of [125I]-CPCR4 from CXCR4 receptor in human Jurkat cells after 2 hrs by gamma counting
J Med Chem 54: 7648-62 (2011)
Article DOI: 10.1021/jm2009716
BindingDB Entry DOI: 10.7270/Q23T9HQV