BDBM50364147 CHEMBL1951595
SMILES: COc1cccc(c1)C(=O)Cn1c(=O)n(C)c2c(C#N)c(N3CCC[C@H](N)C3)n(Cc3ccccc3)c2c1=O
InChI Key: InChIKey=YSWYESAJMAXMOW-NRFANRHFSA-N
Data: 3 IC50
Activity Spreadsheet -- Enzyme Inhibition Constant Data from BindingDB
Found 3 hits for monomerid = 50364147
Trg + Lig
Ki
nM
ΔG°
kcal/mole
IC50
nM
Kd
nM
EC50/IC50
nM
koff
s-1
kon
M-1s-1
pHTemp
°C
Muscarinic acetylcholine receptor M1
(Homo sapiens (Human))
BDBM50364147
(CHEMBL1951595)
Show SMILES COc1cccc(c1)C(=O)Cn1c(=O)n(C)c2c(C#N)c(N3CCC[C@H](N)C3)n(Cc3ccccc3)c2c1=O |r|
Show InChI InChI=1S/C29H30N6O4/c1-32-25-23(15-30)27(33-13-7-11-21(31)17-33)34(16-19-8-4-3-5-9-19)26(25)28(37)35(29(32)38)18-24(36)20-10-6-12-22(14-20)39-2/h3-6,8-10,12,14,21H,7,11,13,16-18,31H2,1-2H3/t21-/m0/s1
n/an/a>1.00E+4n/an/an/an/an/an/a
Argenta Discovery Ltd.
Curated by ChEMBL
Assay Description
Inhibition of M1 receptor
Bioorg Med Chem Lett 22: 1464-8 (2012)
Article DOI: 10.1016/j.bmcl.2011.11.054
BindingDB Entry DOI: 10.7270/Q2SF2WN8
Dipeptidyl peptidase 4
(Homo sapiens (Human))
BDBM50364147
(CHEMBL1951595)
Show SMILES COc1cccc(c1)C(=O)Cn1c(=O)n(C)c2c(C#N)c(N3CCC[C@H](N)C3)n(Cc3ccccc3)c2c1=O |r|
Show InChI InChI=1S/C29H30N6O4/c1-32-25-23(15-30)27(33-13-7-11-21(31)17-33)34(16-19-8-4-3-5-9-19)26(25)28(37)35(29(32)38)18-24(36)20-10-6-12-22(14-20)39-2/h3-6,8-10,12,14,21H,7,11,13,16-18,31H2,1-2H3/t21-/m0/s1
Reactome pathway
n/an/a 1.5n/an/an/an/an/an/a
Argenta Discovery Ltd.
Curated by ChEMBL
Assay Description
Inhibition of human C-terminal step-tagged DPP4 expressed using baculovirus system
Bioorg Med Chem Lett 22: 1464-8 (2012)
Article DOI: 10.1016/j.bmcl.2011.11.054
BindingDB Entry DOI: 10.7270/Q2SF2WN8
Potassium voltage-gated channel subfamily H member 2
(Homo sapiens (Human))
BDBM50364147
(CHEMBL1951595)
Show SMILES COc1cccc(c1)C(=O)Cn1c(=O)n(C)c2c(C#N)c(N3CCC[C@H](N)C3)n(Cc3ccccc3)c2c1=O |r|
Show InChI InChI=1S/C29H30N6O4/c1-32-25-23(15-30)27(33-13-7-11-21(31)17-33)34(16-19-8-4-3-5-9-19)26(25)28(37)35(29(32)38)18-24(36)20-10-6-12-22(14-20)39-2/h3-6,8-10,12,14,21H,7,11,13,16-18,31H2,1-2H3/t21-/m0/s1
Reactome pathway
n/an/a 100n/an/an/an/an/an/a
Argenta Discovery Ltd.
Curated by ChEMBL
Assay Description
Inhibition of human ERG by dofetilide binding assay
Bioorg Med Chem Lett 22: 1464-8 (2012)
Article DOI: 10.1016/j.bmcl.2011.11.054
BindingDB Entry DOI: 10.7270/Q2SF2WN8