BDBM50364158 CHEMBL1951430
SMILES: [#6]-[#8]-c1cccc(c1)-[#6](=O)-[#6]-n1cnc2c(C#N)c(-[#7]-3-[#6]-[#6]-[#6]-[#6@H](-[#7])-[#6]-3)n(-[#6]\[#6]=[#6](\[#6])-[#6])c2c1=O
InChI Key: InChIKey=QXSLAVWJMVTSLE-IBGZPJMESA-N
Data: 2 IC50
Activity Spreadsheet -- Enzyme Inhibition Constant Data from BindingDB
Found 2 hits for monomerid = 50364158
Trg + Lig
Ki
nM
ΔG°
kcal/mole
IC50
nM
Kd
nM
EC50/IC50
nM
koff
s-1
kon
M-1s-1
pHTemp
°C
Dipeptidyl peptidase 4
(Homo sapiens (Human))
BDBM50364158
(CHEMBL1951430)
Show SMILES [#6]-[#8]-c1cccc(c1)-[#6](=O)-[#6]-n1cnc2c(C#N)c(-[#7]-3-[#6]-[#6]-[#6]-[#6@H](-[#7])-[#6]-3)n(-[#6]\[#6]=[#6](\[#6])-[#6])c2c1=O |r|
Show InChI InChI=1S/C26H30N6O3/c1-17(2)9-11-32-24-23(21(13-27)25(32)30-10-5-7-19(28)14-30)29-16-31(26(24)34)15-22(33)18-6-4-8-20(12-18)35-3/h4,6,8-9,12,16,19H,5,7,10-11,14-15,28H2,1-3H3/t19-/m0/s1
Reactome pathway
n/an/a 1n/an/an/an/an/an/a
Argenta Discovery Ltd.
Curated by ChEMBL
Assay Description
Inhibition of human C-terminal step-tagged DPP4 expressed using baculovirus system
Bioorg Med Chem Lett 22: 1464-8 (2012)
Article DOI: 10.1016/j.bmcl.2011.11.054
BindingDB Entry DOI: 10.7270/Q2SF2WN8
Muscarinic acetylcholine receptor M1
(Homo sapiens (Human))
BDBM50364158
(CHEMBL1951430)
Show SMILES [#6]-[#8]-c1cccc(c1)-[#6](=O)-[#6]-n1cnc2c(C#N)c(-[#7]-3-[#6]-[#6]-[#6]-[#6@H](-[#7])-[#6]-3)n(-[#6]\[#6]=[#6](\[#6])-[#6])c2c1=O |r|
Show InChI InChI=1S/C26H30N6O3/c1-17(2)9-11-32-24-23(21(13-27)25(32)30-10-5-7-19(28)14-30)29-16-31(26(24)34)15-22(33)18-6-4-8-20(12-18)35-3/h4,6,8-9,12,16,19H,5,7,10-11,14-15,28H2,1-3H3/t19-/m0/s1
n/an/a>1.00E+4n/an/an/an/an/an/a
Argenta Discovery Ltd.
Curated by ChEMBL
Assay Description
Inhibition of M1 receptor
Bioorg Med Chem Lett 22: 1464-8 (2012)
Article DOI: 10.1016/j.bmcl.2011.11.054
BindingDB Entry DOI: 10.7270/Q2SF2WN8