BDBM50364160 CHEMBL1951428
SMILES: CC#CCn1c(N2CCC[C@H](N)C2)c(C#N)c2ncn(Cc3nccc4ccccc34)c(=O)c12
InChI Key: InChIKey=QVDBJFQOIZXSFJ-IBGZPJMESA-N
Data: 2 IC50
Activity Spreadsheet -- Enzyme Inhibition Constant Data from BindingDB
Found 2 hits for monomerid = 50364160
Trg + Lig
Ki
nM
ΔG°
kcal/mole
IC50
nM
Kd
nM
EC50/IC50
nM
koff
s-1
kon
M-1s-1
pHTemp
°C
Dipeptidyl peptidase 4
(Homo sapiens (Human))
BDBM50364160
(CHEMBL1951428)
Show SMILES CC#CCn1c(N2CCC[C@H](N)C2)c(C#N)c2ncn(Cc3nccc4ccccc34)c(=O)c12 |r|
Show InChI InChI=1S/C26H25N7O/c1-2-3-13-33-24-23(21(14-27)25(33)31-12-6-8-19(28)15-31)30-17-32(26(24)34)16-22-20-9-5-4-7-18(20)10-11-29-22/h4-5,7,9-11,17,19H,6,8,12-13,15-16,28H2,1H3/t19-/m0/s1
Reactome pathway
n/an/a 5n/an/an/an/an/an/a
Argenta Discovery Ltd.
Curated by ChEMBL
Assay Description
Inhibition of human C-terminal step-tagged DPP4 expressed using baculovirus system
Bioorg Med Chem Lett 22: 1464-8 (2012)
Article DOI: 10.1016/j.bmcl.2011.11.054
BindingDB Entry DOI: 10.7270/Q2SF2WN8
Muscarinic acetylcholine receptor M1
(Homo sapiens (Human))
BDBM50364160
(CHEMBL1951428)
Show SMILES CC#CCn1c(N2CCC[C@H](N)C2)c(C#N)c2ncn(Cc3nccc4ccccc34)c(=O)c12 |r|
Show InChI InChI=1S/C26H25N7O/c1-2-3-13-33-24-23(21(14-27)25(33)31-12-6-8-19(28)15-31)30-17-32(26(24)34)16-22-20-9-5-4-7-18(20)10-11-29-22/h4-5,7,9-11,17,19H,6,8,12-13,15-16,28H2,1H3/t19-/m0/s1
n/an/a>1.00E+4n/an/an/an/an/an/a
Argenta Discovery Ltd.
Curated by ChEMBL
Assay Description
Inhibition of M1 receptor
Bioorg Med Chem Lett 22: 1464-8 (2012)
Article DOI: 10.1016/j.bmcl.2011.11.054
BindingDB Entry DOI: 10.7270/Q2SF2WN8