BDBM50364183 CHEMBL1951609
SMILES: [#6]\[#6](-[#6])=[#6]\[#6]-n1c(-[#7]-2-[#6]-[#6]-[#6]-[#7]-[#6]-[#6]-2)c(C#N)c2n(-[#6])c(=O)n(-[#6]-c3nc(-[#6])c4ccccc4n3)c(=O)c12
InChI Key: InChIKey=BDGAXEZYOOOOBQ-UHFFFAOYSA-N
Data: 3 IC50
Activity Spreadsheet -- Enzyme Inhibition Constant Data from BindingDB
Found 3 hits for monomerid = 50364183
Trg + Lig
Ki
nM
ΔG°
kcal/mole
IC50
nM
Kd
nM
EC50/IC50
nM
koff
s-1
kon
M-1s-1
pHTemp
°C
Potassium voltage-gated channel subfamily H member 2
(Homo sapiens (Human))
BDBM50364183
(CHEMBL1951609)
Show SMILES [#6]\[#6](-[#6])=[#6]\[#6]-n1c(-[#7]-2-[#6]-[#6]-[#6]-[#7]-[#6]-[#6]-2)c(C#N)c2n(-[#6])c(=O)n(-[#6]-c3nc(-[#6])c4ccccc4n3)c(=O)c12
Show InChI InChI=1S/C28H32N8O2/c1-18(2)10-14-35-25-24(21(16-29)26(35)34-13-7-11-30-12-15-34)33(4)28(38)36(27(25)37)17-23-31-19(3)20-8-5-6-9-22(20)32-23/h5-6,8-10,30H,7,11-15,17H2,1-4H3
Reactome pathway
n/an/a 2.00E+3n/an/an/an/an/an/a
Argenta Discovery Ltd.
Curated by ChEMBL
Assay Description
Inhibition of human ERG by dofetilide binding assay
Bioorg Med Chem Lett 22: 1464-8 (2012)
Article DOI: 10.1016/j.bmcl.2011.11.054
BindingDB Entry DOI: 10.7270/Q2SF2WN8
Dipeptidyl peptidase 4
(Homo sapiens (Human))
BDBM50364183
(CHEMBL1951609)
Show SMILES [#6]\[#6](-[#6])=[#6]\[#6]-n1c(-[#7]-2-[#6]-[#6]-[#6]-[#7]-[#6]-[#6]-2)c(C#N)c2n(-[#6])c(=O)n(-[#6]-c3nc(-[#6])c4ccccc4n3)c(=O)c12
Show InChI InChI=1S/C28H32N8O2/c1-18(2)10-14-35-25-24(21(16-29)26(35)34-13-7-11-30-12-15-34)33(4)28(38)36(27(25)37)17-23-31-19(3)20-8-5-6-9-22(20)32-23/h5-6,8-10,30H,7,11-15,17H2,1-4H3
Reactome pathway
n/an/a 2n/an/an/an/an/an/a
Argenta Discovery Ltd.
Curated by ChEMBL
Assay Description
Inhibition of human C-terminal step-tagged DPP4 expressed using baculovirus system
Bioorg Med Chem Lett 22: 1464-8 (2012)
Article DOI: 10.1016/j.bmcl.2011.11.054
BindingDB Entry DOI: 10.7270/Q2SF2WN8
Muscarinic acetylcholine receptor M1
(Homo sapiens (Human))
BDBM50364183
(CHEMBL1951609)
Show SMILES [#6]\[#6](-[#6])=[#6]\[#6]-n1c(-[#7]-2-[#6]-[#6]-[#6]-[#7]-[#6]-[#6]-2)c(C#N)c2n(-[#6])c(=O)n(-[#6]-c3nc(-[#6])c4ccccc4n3)c(=O)c12
Show InChI InChI=1S/C28H32N8O2/c1-18(2)10-14-35-25-24(21(16-29)26(35)34-13-7-11-30-12-15-34)33(4)28(38)36(27(25)37)17-23-31-19(3)20-8-5-6-9-22(20)32-23/h5-6,8-10,30H,7,11-15,17H2,1-4H3
n/an/a>1.00E+4n/an/an/an/an/an/a
Argenta Discovery Ltd.
Curated by ChEMBL
Assay Description
Inhibition of M1 receptor
Bioorg Med Chem Lett 22: 1464-8 (2012)
Article DOI: 10.1016/j.bmcl.2011.11.054
BindingDB Entry DOI: 10.7270/Q2SF2WN8