BDBM50364185 CHEMBL1949693
SMILES: [#6]\[#6](-[#6])=[#6]\[#6]-n1c(-[#7]-2-[#6]-[#6]-[#6]-[#7]-[#6]-[#6]-2)c(C#N)c2n(-[#6])c(=O)n(-[#6]-c3c(cnc4ccccc34)C#N)c(=O)c12
InChI Key: InChIKey=PARCWEQRCVIVGZ-UHFFFAOYSA-N
Data: 3 IC50
Activity Spreadsheet -- Enzyme Inhibition Constant Data from BindingDB
Found 3 hits for monomerid = 50364185
Trg + Lig
Ki
nM
ΔG°
kcal/mole
IC50
nM
Kd
nM
EC50/IC50
nM
koff
s-1
kon
M-1s-1
pHTemp
°C
Potassium voltage-gated channel subfamily H member 2
(Homo sapiens (Human))
BDBM50364185
(CHEMBL1949693)
Show SMILES [#6]\[#6](-[#6])=[#6]\[#6]-n1c(-[#7]-2-[#6]-[#6]-[#6]-[#7]-[#6]-[#6]-2)c(C#N)c2n(-[#6])c(=O)n(-[#6]-c3c(cnc4ccccc34)C#N)c(=O)c12
Show InChI InChI=1S/C29H30N8O2/c1-19(2)9-13-36-26-25(22(16-31)27(36)35-12-6-10-32-11-14-35)34(3)29(39)37(28(26)38)18-23-20(15-30)17-33-24-8-5-4-7-21(23)24/h4-5,7-9,17,32H,6,10-14,18H2,1-3H3
Reactome pathway
n/an/a 900n/an/an/an/an/an/a
Argenta Discovery Ltd.
Curated by ChEMBL
Assay Description
Inhibition of human ERG by dofetilide binding assay
Bioorg Med Chem Lett 22: 1464-8 (2012)
Article DOI: 10.1016/j.bmcl.2011.11.054
BindingDB Entry DOI: 10.7270/Q2SF2WN8
Dipeptidyl peptidase 4
(Homo sapiens (Human))
BDBM50364185
(CHEMBL1949693)
Show SMILES [#6]\[#6](-[#6])=[#6]\[#6]-n1c(-[#7]-2-[#6]-[#6]-[#6]-[#7]-[#6]-[#6]-2)c(C#N)c2n(-[#6])c(=O)n(-[#6]-c3c(cnc4ccccc34)C#N)c(=O)c12
Show InChI InChI=1S/C29H30N8O2/c1-19(2)9-13-36-26-25(22(16-31)27(36)35-12-6-10-32-11-14-35)34(3)29(39)37(28(26)38)18-23-20(15-30)17-33-24-8-5-4-7-21(23)24/h4-5,7-9,17,32H,6,10-14,18H2,1-3H3
Reactome pathway
n/an/a 5.5n/an/an/an/an/an/a
Argenta Discovery Ltd.
Curated by ChEMBL
Assay Description
Inhibition of human C-terminal step-tagged DPP4 expressed using baculovirus system
Bioorg Med Chem Lett 22: 1464-8 (2012)
Article DOI: 10.1016/j.bmcl.2011.11.054
BindingDB Entry DOI: 10.7270/Q2SF2WN8
Muscarinic acetylcholine receptor M1
(Homo sapiens (Human))
BDBM50364185
(CHEMBL1949693)
Show SMILES [#6]\[#6](-[#6])=[#6]\[#6]-n1c(-[#7]-2-[#6]-[#6]-[#6]-[#7]-[#6]-[#6]-2)c(C#N)c2n(-[#6])c(=O)n(-[#6]-c3c(cnc4ccccc34)C#N)c(=O)c12
Show InChI InChI=1S/C29H30N8O2/c1-19(2)9-13-36-26-25(22(16-31)27(36)35-12-6-10-32-11-14-35)34(3)29(39)37(28(26)38)18-23-20(15-30)17-33-24-8-5-4-7-21(23)24/h4-5,7-9,17,32H,6,10-14,18H2,1-3H3
n/an/a>1.00E+4n/an/an/an/an/an/a
Argenta Discovery Ltd.
Curated by ChEMBL
Assay Description
Inhibition of M1 receptor
Bioorg Med Chem Lett 22: 1464-8 (2012)
Article DOI: 10.1016/j.bmcl.2011.11.054
BindingDB Entry DOI: 10.7270/Q2SF2WN8