BDBM50364198 CHEMBL1951630
SMILES: CN(Cc1cc(cc(c1)C(F)(F)F)C(F)(F)F)C(=O)[C@H]1CCN(C[C@@H]1c1ccc(F)cc1C)C(=O)C1CCN(CC1)C(C)=O
InChI Key: InChIKey=SIHCCJJWSBAMTD-RRPNLBNLSA-N
Data: 1 IC50
Activity Spreadsheet -- Enzyme Inhibition Constant Data from BindingDB
Found 1 hit for monomerid = 50364198
Trg + Lig
Ki
nM
ΔG°
kcal/mole
IC50
nM
Kd
nM
EC50/IC50
nM
koff
s-1
kon
M-1s-1
pHTemp
°C
Neurokinin 1 receptor
(Homo sapiens (Human))
BDBM50364198
(CHEMBL1951630)
Show SMILES CN(Cc1cc(cc(c1)C(F)(F)F)C(F)(F)F)C(=O)[C@H]1CCN(C[C@@H]1c1ccc(F)cc1C)C(=O)C1CCN(CC1)C(C)=O |r|
Show InChI InChI=1S/C31H34F7N3O3/c1-18-12-24(32)4-5-25(18)27-17-41(28(43)21-6-9-40(10-7-21)19(2)42)11-8-26(27)29(44)39(3)16-20-13-22(30(33,34)35)15-23(14-20)31(36,37)38/h4-5,12-15,21,26-27H,6-11,16-17H2,1-3H3/t26-,27+/m0/s1
Reactome pathway
n/an/a 0.0470n/an/an/an/an/an/a
Takeda Pharmaceutical Co. Ltd
Curated by ChEMBL
Assay Description
Displacement of [125I]BH-SP from tachykinin NK1 receptor in human IM9 cells after 30 mins by scintillation counting
Bioorg Med Chem 20: 962-77 (2012)
Article DOI: 10.1016/j.bmc.2011.11.048
BindingDB Entry DOI: 10.7270/Q2NP24WG