BDBM50364288 CHEMBL1952301
SMILES: CCCCCCCCCc1ccccc1B(O)O
InChI Key: InChIKey=KGZQCZWTIFBRHM-UHFFFAOYSA-N
Data: 4 IC50
Activity Spreadsheet -- Enzyme Inhibition Constant Data from BindingDB
Found 4 hits for monomerid = 50364288
Trg + Lig
Ki
nM
ΔG°
kcal/mole
IC50
nM
Kd
nM
EC50/IC50
nM
koff
s-1
kon
M-1s-1
pHTemp
°C
Endothelial lipase
(Homo sapiens (Human))
BDBM50364288
(CHEMBL1952301)
Show SMILES CCCCCCCCCc1ccccc1B(O)O
Show InChI InChI=1S/C15H25BO2/c1-2-3-4-5-6-7-8-11-14-12-9-10-13-15(14)16(17)18/h9-10,12-13,17-18H,2-8,11H2,1H3
n/an/a 5.00E+4n/an/an/an/an/an/a
Tufts University School of Medicine
Curated by ChEMBL
Assay Description
Inhibition of human endothelial lipase expressed using recombinant adenovirus using glycerol-tri[9,10(n)-3H]oleate after 1 hr by vesicle assay
Bioorg Med Chem Lett 22: 1397-401 (2012)
Article DOI: 10.1016/j.bmcl.2011.12.043
BindingDB Entry DOI: 10.7270/Q28G8M5N
Lipoprotein lipase
(Homo sapiens (Human))
BDBM50364288
(CHEMBL1952301)
Show SMILES CCCCCCCCCc1ccccc1B(O)O
Show InChI InChI=1S/C15H25BO2/c1-2-3-4-5-6-7-8-11-14-12-9-10-13-15(14)16(17)18/h9-10,12-13,17-18H,2-8,11H2,1H3
Reactome pathway
n/an/a>5.00E+5n/an/an/an/an/an/a
Tufts University School of Medicine
Curated by ChEMBL
Assay Description
Inhibition of human lipoprotein lipase expressed in HEK293 cells using bis-BD-PC and mono-BD-TG as substrate incubated for 10 mins prior to substrate...
Bioorg Med Chem Lett 22: 1397-401 (2012)
Article DOI: 10.1016/j.bmcl.2011.12.043
BindingDB Entry DOI: 10.7270/Q28G8M5N
Endothelial lipase
(Homo sapiens (Human))
BDBM50364288
(CHEMBL1952301)
Show SMILES CCCCCCCCCc1ccccc1B(O)O
Show InChI InChI=1S/C15H25BO2/c1-2-3-4-5-6-7-8-11-14-12-9-10-13-15(14)16(17)18/h9-10,12-13,17-18H,2-8,11H2,1H3
n/an/a 1.10E+4n/an/an/an/an/an/a
Tufts University School of Medicine
Curated by ChEMBL
Assay Description
Inhibition of human endothelial lipase overexpressed in HUVEC cells using bis-BD-PC and mono-BD-TG as substrate incubated for 10 mins prior to substr...
Bioorg Med Chem Lett 22: 1397-401 (2012)
Article DOI: 10.1016/j.bmcl.2011.12.043
BindingDB Entry DOI: 10.7270/Q28G8M5N
Lipoprotein lipase
(Homo sapiens (Human))
BDBM50364288
(CHEMBL1952301)
Show SMILES CCCCCCCCCc1ccccc1B(O)O
Show InChI InChI=1S/C15H25BO2/c1-2-3-4-5-6-7-8-11-14-12-9-10-13-15(14)16(17)18/h9-10,12-13,17-18H,2-8,11H2,1H3
Reactome pathway
n/an/a>5.00E+4n/an/an/an/an/an/a
Tufts University School of Medicine
Curated by ChEMBL
Assay Description
Inhibition of human lipoprotein lipase expressed using recombinant adenovirus using glycerol-tri[9,10(n)-3H]oleate after 1 hr by vesicle assay
Bioorg Med Chem Lett 22: 1397-401 (2012)
Article DOI: 10.1016/j.bmcl.2011.12.043
BindingDB Entry DOI: 10.7270/Q28G8M5N