BDBM50364333 CHEMBL1950091
SMILES: Cc1n[nH]c2nc3c(C)cc(Cl)cc3c(C(O)c3cnc(C)nc3)c12
InChI Key: InChIKey=BSQBUOMKYFGDQP-UHFFFAOYSA-N
Data: 1 KI  2 IC50
Activity Spreadsheet -- Enzyme Inhibition Constant Data from BindingDB
Found 3 hits for monomerid = 50364333
Trg + Lig
Ki
nM
ΔG°
kcal/mole
IC50
nM
Kd
nM
EC50/IC50
nM
koff
s-1
kon
M-1s-1
pHTemp
°C
cAMP and cAMP-inhibited cGMP 3',5'-cyclic phosphodiesterase 10A
(Homo sapiens (Human))
BDBM50364333
(CHEMBL1950091)
Show SMILES Cc1n[nH]c2nc3c(C)cc(Cl)cc3c(C(O)c3cnc(C)nc3)c12
Show InChI InChI=1S/C18H16ClN5O/c1-8-4-12(19)5-13-15(17(25)11-6-20-10(3)21-7-11)14-9(2)23-24-18(14)22-16(8)13/h4-7,17,25H,1-3H3,(H,22,23,24)
Reactome pathway
3n/an/an/an/an/an/an/an/a
Merck Research Laboratories
Curated by ChEMBL
Assay Description
Inhibition of human recombinant PDE10A assessed as hydrolysis of cAMP to AMP using [3H]cAMP substrate by scintillation proximity assay
Bioorg Med Chem Lett 22: 1335-9 (2012)
Article DOI: 10.1016/j.bmcl.2011.12.080
BindingDB Entry DOI: 10.7270/Q2RF5VGF
Cytochrome P450 3A4
(Homo sapiens (Human))
BDBM50364333
(CHEMBL1950091)
Show SMILES Cc1n[nH]c2nc3c(C)cc(Cl)cc3c(C(O)c3cnc(C)nc3)c12
Show InChI InChI=1S/C18H16ClN5O/c1-8-4-12(19)5-13-15(17(25)11-6-20-10(3)21-7-11)14-9(2)23-24-18(14)22-16(8)13/h4-7,17,25H,1-3H3,(H,22,23,24)
Reactome pathway
n/an/a 7.90E+3n/an/an/an/an/an/a
Merck Research Laboratories
Curated by ChEMBL
Assay Description
Reversible inhibition of CYP3A4
Bioorg Med Chem Lett 22: 1335-9 (2012)
Article DOI: 10.1016/j.bmcl.2011.12.080
BindingDB Entry DOI: 10.7270/Q2RF5VGF
Cytochrome P450 3A4
(Homo sapiens (Human))
BDBM50364333
(CHEMBL1950091)
Show SMILES Cc1n[nH]c2nc3c(C)cc(Cl)cc3c(C(O)c3cnc(C)nc3)c12
Show InChI InChI=1S/C18H16ClN5O/c1-8-4-12(19)5-13-15(17(25)11-6-20-10(3)21-7-11)14-9(2)23-24-18(14)22-16(8)13/h4-7,17,25H,1-3H3,(H,22,23,24)
Reactome pathway
n/an/a>2.00E+4n/an/an/an/an/an/a
Merck Research Laboratories
Curated by ChEMBL
Assay Description
Time dependent inhibition of CYP3A4
Bioorg Med Chem Lett 22: 1335-9 (2012)
Article DOI: 10.1016/j.bmcl.2011.12.080
BindingDB Entry DOI: 10.7270/Q2RF5VGF