null
SMILES: [#6]-[#6]-[#8]-[#6](=O)\[#6]=[#6]\[#6](=O)-[#7](-[#6]-[#6](-[#7])=O)-[#7]-[#6](=O)-[#6@@H]-1-[#6]-[#6]-[#6]-[#7]-1-[#6](=O)-[#6](\[#7]-[#6](-[#6])=O)=[#6](\[#6])-[#6]
InChI Key: InChIKey=DQFYLNZAQKRLTN-VFNNOXKTSA-N
Activity Spreadsheet -- Enzyme Inhibition Constant Data from BindingDB
Found 1 hit for monomerid = 50364355
Trg + Lig
Ki
nM
ΔG°
kcal/mole
IC50
nM
Kd
nM
EC50/IC50
nM
koff
s-1
kon
M-1s-1
pHTemp
°C
Legumain
(Mus musculus)
BDBM50364355
(CHEMBL1950111)
Show SMILES [#6]-[#6]-[#8]-[#6](=O)\[#6]=[#6]\[#6](=O)-[#7](-[#6]-[#6](-[#7])=O)-[#7]-[#6](=O)-[#6@@H]-1-[#6]-[#6]-[#6]-[#7]-1-[#6](=O)-[#6](\[#7]-[#6](-[#6])=O)=[#6](\[#6])-[#6] |r|
Show InChI InChI=1S/C20H29N5O7/c1-5-32-17(29)9-8-16(28)25(11-15(21)27)23-19(30)14-7-6-10-24(14)20(31)18(12(2)3)22-13(4)26/h8-9,14H,5-7,10-11H2,1-4H3,(H2,21,27)(H,22,26)(H,23,30)/b9-8+/t14-/m0/s1
Reactome pathway
n/an/a 148n/an/an/an/an/an/a
Stanford University School of Medicine
Curated by ChEMBL
Assay Description
Inhibition of mouse recombinant legumain using Cbz-Ala-Ala-Asn-AMC as substrate measured every 30 secs for 2.5 hrs by fluorimetry
Bioorg Med Chem Lett 22: 1340-3 (2012)
Article DOI: 10.1016/j.bmcl.2011.12.079
BindingDB Entry DOI: 10.7270/Q2H132GV