BDBM50364356 CHEMBL1950112
SMILES: CCOC(=O)\C=C\C(=O)N(CC(N)=O)NC(=O)[C@@H]1CCCN1C(=O)C1(CC1)NC(C)=O
InChI Key: InChIKey=RSAAOECPPSSDMH-YBJDMEARSA-N
Data: 1 IC50
Activity Spreadsheet -- Enzyme Inhibition Constant Data from BindingDB
Found 1 hit for monomerid = 50364356
Trg + Lig
Ki
nM
ΔG°
kcal/mole
IC50
nM
Kd
nM
EC50/IC50
nM
koff
s-1
kon
M-1s-1
pHTemp
°C
Legumain
(Mus musculus)
BDBM50364356
(CHEMBL1950112)
Show SMILES CCOC(=O)\C=C\C(=O)N(CC(N)=O)NC(=O)[C@@H]1CCCN1C(=O)C1(CC1)NC(C)=O |r|
Show InChI InChI=1S/C19H27N5O7/c1-3-31-16(28)7-6-15(27)24(11-14(20)26)22-17(29)13-5-4-10-23(13)18(30)19(8-9-19)21-12(2)25/h6-7,13H,3-5,8-11H2,1-2H3,(H2,20,26)(H,21,25)(H,22,29)/b7-6+/t13-/m0/s1
Reactome pathway
n/an/a 9.30n/an/an/an/an/an/a
Stanford University School of Medicine
Curated by ChEMBL
Assay Description
Inhibition of mouse recombinant legumain using Cbz-Ala-Ala-Asn-AMC as substrate measured every 30 secs for 2.5 hrs by fluorimetry
Bioorg Med Chem Lett 22: 1340-3 (2012)
Article DOI: 10.1016/j.bmcl.2011.12.079
BindingDB Entry DOI: 10.7270/Q2H132GV