BDBM50364358 CHEMBL1950273
SMILES: CCOC(=O)\C=C\C(=O)N(CC(N)=O)NC(=O)[C@@H]1CCCN1C(=O)[C@H](CC#C)NC(C)=O
InChI Key: InChIKey=HOMCLOIEKNKVPL-CWCINCBISA-N
Data: 1 IC50
Activity Spreadsheet -- Enzyme Inhibition Constant Data from BindingDB
Found 1 hit for monomerid = 50364358
Trg + Lig
Ki
nM
ΔG°
kcal/mole
IC50
nM
Kd
nM
EC50/IC50
nM
koff
s-1
kon
M-1s-1
pHTemp
°C
Legumain
(Mus musculus)
BDBM50364358
(CHEMBL1950273)
Show SMILES CCOC(=O)\C=C\C(=O)N(CC(N)=O)NC(=O)[C@@H]1CCCN1C(=O)[C@H](CC#C)NC(C)=O |r|
Show InChI InChI=1S/C20H27N5O7/c1-4-7-14(22-13(3)26)20(31)24-11-6-8-15(24)19(30)23-25(12-16(21)27)17(28)9-10-18(29)32-5-2/h1,9-10,14-15H,5-8,11-12H2,2-3H3,(H2,21,27)(H,22,26)(H,23,30)/b10-9+/t14-,15-/m0/s1
Reactome pathway
n/an/a 17n/an/an/an/an/an/a
Stanford University School of Medicine
Curated by ChEMBL
Assay Description
Inhibition of mouse recombinant legumain using Cbz-Ala-Ala-Asn-AMC as substrate measured every 30 secs for 2.5 hrs by fluorimetry
Bioorg Med Chem Lett 22: 1340-3 (2012)
Article DOI: 10.1016/j.bmcl.2011.12.079
BindingDB Entry DOI: 10.7270/Q2H132GV