BDBM50364363 CHEMBL1950278
SMILES: CCOC(=O)\C=C\C(=O)N(CC(N)=O)NC(=O)[C@@H]1CCCN1C(=O)c1ccc(CNC(C)=O)cc1
InChI Key: InChIKey=ZHSOYVJVEDSEEE-ZGKFYVQTSA-N
Data: 1 IC50
Activity Spreadsheet -- Enzyme Inhibition Constant Data from BindingDB
Found 1 hit for monomerid = 50364363
Trg + Lig
Ki
nM
ΔG°
kcal/mole
IC50
nM
Kd
nM
EC50/IC50
nM
koff
s-1
kon
M-1s-1
pHTemp
°C
Legumain
(Mus musculus)
BDBM50364363
(CHEMBL1950278)
Show SMILES CCOC(=O)\C=C\C(=O)N(CC(N)=O)NC(=O)[C@@H]1CCCN1C(=O)c1ccc(CNC(C)=O)cc1 |r|
Show InChI InChI=1S/C23H29N5O7/c1-3-35-21(32)11-10-20(31)28(14-19(24)30)26-22(33)18-5-4-12-27(18)23(34)17-8-6-16(7-9-17)13-25-15(2)29/h6-11,18H,3-5,12-14H2,1-2H3,(H2,24,30)(H,25,29)(H,26,33)/b11-10+/t18-/m0/s1
Reactome pathway
n/an/a 267n/an/an/an/an/an/a
Stanford University School of Medicine
Curated by ChEMBL
Assay Description
Inhibition of mouse recombinant legumain using Cbz-Ala-Ala-Asn-AMC as substrate measured every 30 secs for 2.5 hrs by fluorimetry
Bioorg Med Chem Lett 22: 1340-3 (2012)
Article DOI: 10.1016/j.bmcl.2011.12.079
BindingDB Entry DOI: 10.7270/Q2H132GV