BDBM50364388 CHEMBL1950314
SMILES: C[C@H](NC(=O)[C@@H](NC(=O)C(C)(C)O)[C@@H](C)c1ccc(cc1)-c1cn[nH]c1)c1nc2cc(Cl)c(Cl)cc2[nH]1
InChI Key: InChIKey=YWDZSZRFFJXKOI-OKHZJLECSA-N
Data: 2 IC50
Activity Spreadsheet -- Enzyme Inhibition Constant Data from BindingDB
Found 2 hits for monomerid = 50364388
Trg + Lig
Ki
nM
ΔG°
kcal/mole
IC50
nM
Kd
nM
EC50/IC50
nM
koff
s-1
kon
M-1s-1
pHTemp
°C
Lysosomal Pro-X carboxypeptidase
(Mus musculus)
BDBM50364388
(CHEMBL1950314)
Show SMILES C[C@H](NC(=O)[C@@H](NC(=O)C(C)(C)O)[C@@H](C)c1ccc(cc1)-c1cn[nH]c1)c1nc2cc(Cl)c(Cl)cc2[nH]1 |r|
Show InChI InChI=1S/C26H28Cl2N6O3/c1-13(15-5-7-16(8-6-15)17-11-29-30-12-17)22(34-25(36)26(3,4)37)24(35)31-14(2)23-32-20-9-18(27)19(28)10-21(20)33-23/h5-14,22,37H,1-4H3,(H,29,30)(H,31,35)(H,32,33)(H,34,36)/t13-,14-,22-/m0/s1
Reactome pathway
n/an/a 78n/an/an/an/an/an/a
Merck Research Laboratories
Curated by ChEMBL
Assay Description
Inhibition of PrCP-mediated angiotensin3 cleavage in mouse plasma using Mca-Ala-Lys-Dnp as substrate for 8 mins by LC/MS analysis
Bioorg Med Chem Lett 22: 1774-8 (2012)
Article DOI: 10.1016/j.bmcl.2011.12.064
BindingDB Entry DOI: 10.7270/Q27H1K28
Prolylcarboxypeptidase (PRCP)
(Homo sapiens (Human))
BDBM50364388
(CHEMBL1950314)
Show SMILES C[C@H](NC(=O)[C@@H](NC(=O)C(C)(C)O)[C@@H](C)c1ccc(cc1)-c1cn[nH]c1)c1nc2cc(Cl)c(Cl)cc2[nH]1 |r|
Show InChI InChI=1S/C26H28Cl2N6O3/c1-13(15-5-7-16(8-6-15)17-11-29-30-12-17)22(34-25(36)26(3,4)37)24(35)31-14(2)23-32-20-9-18(27)19(28)10-21(20)33-23/h5-14,22,37H,1-4H3,(H,29,30)(H,31,35)(H,32,33)(H,34,36)/t13-,14-,22-/m0/s1
Reactome pathway
n/an/a 5.60n/an/an/an/an/an/a
Merck Research Laboratories
Curated by ChEMBL
Assay Description
Inhibition of human recombinant PrCP using Mca-Ala-Pro-Lys(Dnp)-OH as substrate for 30 mins by continuous fluorimetric assay
Bioorg Med Chem Lett 22: 1774-8 (2012)
Article DOI: 10.1016/j.bmcl.2011.12.064
BindingDB Entry DOI: 10.7270/Q27H1K28