null
SMILES: Brc1cccc(NC(=O)Nc2ccc(cc2)-c2ccnc3nc[nH]c23)c1
InChI Key: InChIKey=MWWLVSZLKTULPS-UHFFFAOYSA-N
Activity Spreadsheet -- Enzyme Inhibition Constant Data from BindingDB
Found 2 hits for monomerid = 50364630
Trg + Lig
Ki
nM
ΔG°
kcal/mole
IC50
nM
Kd
nM
EC50/IC50
nM
koff
s-1
kon
M-1s-1
pHTemp
°C
Cytochrome P450 3A5
(Homo sapiens (Human))
BDBM50364630
(CHEMBL1951325)
Show SMILES Brc1cccc(NC(=O)Nc2ccc(cc2)-c2ccnc3nc[nH]c23)c1
Show InChI InChI=1S/C19H14BrN5O/c20-13-2-1-3-15(10-13)25-19(26)24-14-6-4-12(5-7-14)16-8-9-21-18-17(16)22-11-23-18/h1-11H,(H,21,22,23)(H2,24,25,26)
n/an/a 1.14E+4n/an/an/an/an/an/a
The Scripps Research Institute
Curated by ChEMBL
Assay Description
Inhibition of recombinant human CYP3A5 in supersomes using midazolam as substrate after 5 mins by LC-MS/MS analysis
Bioorg Med Chem Lett 22: 1611-4 (2012)
Article DOI: 10.1016/j.bmcl.2011.12.125
BindingDB Entry DOI: 10.7270/Q2T72HXJ
Cytochrome P450 3A4
(Homo sapiens (Human))
BDBM50364630
(CHEMBL1951325)
Show SMILES Brc1cccc(NC(=O)Nc2ccc(cc2)-c2ccnc3nc[nH]c23)c1
Show InChI InChI=1S/C19H14BrN5O/c20-13-2-1-3-15(10-13)25-19(26)24-14-6-4-12(5-7-14)16-8-9-21-18-17(16)22-11-23-18/h1-11H,(H,21,22,23)(H2,24,25,26)
Reactome pathway
n/an/a 92n/an/an/an/an/an/a
The Scripps Research Institute
Curated by ChEMBL
Assay Description
Inhibition of recombinant human CYP3A4 in supersomes using midazolam as substrate after 5 mins by LC-MS/MS analysis
Bioorg Med Chem Lett 22: 1611-4 (2012)
Article DOI: 10.1016/j.bmcl.2011.12.125
BindingDB Entry DOI: 10.7270/Q2T72HXJ