BDBM50364679 CHEMBL1951468::US8785634, 2
SMILES: [O-][n+]1ccc(Cl)cc1C1OC2(CCN(Cc3ccc(OC(F)(F)F)cc3)CC2)c2ccccc12
InChI Key: InChIKey=ZZLWRNKWIAOSML-UHFFFAOYSA-N
Data: 3 IC50
Activity Spreadsheet -- Enzyme Inhibition Constant Data from BindingDB
Found 3 hits for monomerid = 50364679
Trg + Lig
Ki
nM
ΔG°
kcal/mole
IC50
nM
Kd
nM
EC50/IC50
nM
koff
s-1
kon
M-1s-1
pHTemp
°C
Prolylcarboxypeptidase (PRCP)
(Homo sapiens (Human))
BDBM50364679
(CHEMBL1951468 | US8785634, 2)
Show SMILES [O-][n+]1ccc(Cl)cc1C1OC2(CCN(Cc3ccc(OC(F)(F)F)cc3)CC2)c2ccccc12
Show InChI InChI=1S/C25H22ClF3N2O3/c26-18-9-12-31(32)22(15-18)23-20-3-1-2-4-21(20)24(34-23)10-13-30(14-11-24)16-17-5-7-19(8-6-17)33-25(27,28)29/h1-9,12,15,23H,10-11,13-14,16H2
Reactome pathway
US Patent
n/an/a 1.30n/an/an/an/an/an/a
Merck Sharp & Dohme Corp
US Patent
Assay Description
The potency of compounds of formula I against PrCP was determined by a fluorescence intensity kinetic assay measuring the IC50 values of PrCP inhibit...
US Patent US8785634 (2014)
BindingDB Entry DOI: 10.7270/Q2HH6HRS
Lysosomal Pro-X carboxypeptidase
(Mus musculus)
BDBM50364679
(CHEMBL1951468 | US8785634, 2)
Show SMILES [O-][n+]1ccc(Cl)cc1C1OC2(CCN(Cc3ccc(OC(F)(F)F)cc3)CC2)c2ccccc12
Show InChI InChI=1S/C25H22ClF3N2O3/c26-18-9-12-31(32)22(15-18)23-20-3-1-2-4-21(20)24(34-23)10-13-30(14-11-24)16-17-5-7-19(8-6-17)33-25(27,28)29/h1-9,12,15,23H,10-11,13-14,16H2
Reactome pathway
n/an/a 0.380n/an/an/an/an/an/a
Merck Research Laboratories
Curated by ChEMBL
Assay Description
Inhibition of mouse PrCP
Bioorg Med Chem Lett 22: 1550-6 (2012)
Article DOI: 10.1016/j.bmcl.2012.01.002
BindingDB Entry DOI: 10.7270/Q2JS9QXQ
Prolylcarboxypeptidase (PRCP)
(Homo sapiens (Human))
BDBM50364679
(CHEMBL1951468 | US8785634, 2)
Show SMILES [O-][n+]1ccc(Cl)cc1C1OC2(CCN(Cc3ccc(OC(F)(F)F)cc3)CC2)c2ccccc12
Show InChI InChI=1S/C25H22ClF3N2O3/c26-18-9-12-31(32)22(15-18)23-20-3-1-2-4-21(20)24(34-23)10-13-30(14-11-24)16-17-5-7-19(8-6-17)33-25(27,28)29/h1-9,12,15,23H,10-11,13-14,16H2
Reactome pathway
n/an/a 1.20n/an/an/an/an/an/a
Merck Research Laboratories
Curated by ChEMBL
Assay Description
Inhibition of human PrCP
Bioorg Med Chem Lett 22: 1550-6 (2012)
Article DOI: 10.1016/j.bmcl.2012.01.002
BindingDB Entry DOI: 10.7270/Q2JS9QXQ