BDBM50364685 CHEMBL1951474
SMILES: CC(N1CCC2(CC1)OC(c1ccccc21)c1cc(Cl)cc(Cl)c1)c1ccc(F)cn1
InChI Key: InChIKey=WGLYTPBNDLNJIS-UHFFFAOYSA-N
Data: 3 IC50
Activity Spreadsheet -- Enzyme Inhibition Constant Data from BindingDB
Found 3 hits for monomerid = 50364685
Trg + Lig
Ki
nM
ΔG°
kcal/mole
IC50
nM
Kd
nM
EC50/IC50
nM
koff
s-1
kon
M-1s-1
pHTemp
°C
Prolylcarboxypeptidase (PRCP)
(Homo sapiens (Human))
BDBM50364685
(CHEMBL1951474)
Show SMILES CC(N1CCC2(CC1)OC(c1ccccc21)c1cc(Cl)cc(Cl)c1)c1ccc(F)cn1
Show InChI InChI=1S/C25H23Cl2FN2O/c1-16(23-7-6-20(28)15-29-23)30-10-8-25(9-11-30)22-5-3-2-4-21(22)24(31-25)17-12-18(26)14-19(27)13-17/h2-7,12-16,24H,8-11H2,1H3
Reactome pathway
n/an/a 0.730n/an/an/an/an/an/a
Merck Research Laboratories
Curated by ChEMBL
Assay Description
Inhibition of human PrCP
Bioorg Med Chem Lett 22: 1550-6 (2012)
Article DOI: 10.1016/j.bmcl.2012.01.002
BindingDB Entry DOI: 10.7270/Q2JS9QXQ
Lysosomal Pro-X carboxypeptidase
(Mus musculus)
BDBM50364685
(CHEMBL1951474)
Show SMILES CC(N1CCC2(CC1)OC(c1ccccc21)c1cc(Cl)cc(Cl)c1)c1ccc(F)cn1
Show InChI InChI=1S/C25H23Cl2FN2O/c1-16(23-7-6-20(28)15-29-23)30-10-8-25(9-11-30)22-5-3-2-4-21(22)24(31-25)17-12-18(26)14-19(27)13-17/h2-7,12-16,24H,8-11H2,1H3
Reactome pathway
n/an/a 90n/an/an/an/an/an/a
Merck Research Laboratories
Curated by ChEMBL
Assay Description
Inhibition of PrCP in mouse plasma assessed as angiotensin 3 cleavage by whole serum shift assay
Bioorg Med Chem Lett 22: 1550-6 (2012)
Article DOI: 10.1016/j.bmcl.2012.01.002
BindingDB Entry DOI: 10.7270/Q2JS9QXQ
Lysosomal Pro-X carboxypeptidase
(Mus musculus)
BDBM50364685
(CHEMBL1951474)
Show SMILES CC(N1CCC2(CC1)OC(c1ccccc21)c1cc(Cl)cc(Cl)c1)c1ccc(F)cn1
Show InChI InChI=1S/C25H23Cl2FN2O/c1-16(23-7-6-20(28)15-29-23)30-10-8-25(9-11-30)22-5-3-2-4-21(22)24(31-25)17-12-18(26)14-19(27)13-17/h2-7,12-16,24H,8-11H2,1H3
Reactome pathway
n/an/a 0.310n/an/an/an/an/an/a
Merck Research Laboratories
Curated by ChEMBL
Assay Description
Inhibition of mouse PrCP
Bioorg Med Chem Lett 22: 1550-6 (2012)
Article DOI: 10.1016/j.bmcl.2012.01.002
BindingDB Entry DOI: 10.7270/Q2JS9QXQ