BDBM50364686 CHEMBL1951475
SMILES: OCC(N1CCC2(CC1)OC(c1cccnc21)c1cc(Cl)cc(Cl)c1)c1ccccc1
InChI Key: InChIKey=AVTPDXSBHVFETK-UHFFFAOYSA-N
Data: 2 IC50
Activity Spreadsheet -- Enzyme Inhibition Constant Data from BindingDB
Found 2 hits for monomerid = 50364686
Trg + Lig
Ki
nM
ΔG°
kcal/mole
IC50
nM
Kd
nM
EC50/IC50
nM
koff
s-1
kon
M-1s-1
pHTemp
°C
Lysosomal Pro-X carboxypeptidase
(Mus musculus)
BDBM50364686
(CHEMBL1951475)
Show SMILES OCC(N1CCC2(CC1)OC(c1cccnc21)c1cc(Cl)cc(Cl)c1)c1ccccc1
Show InChI InChI=1S/C25H24Cl2N2O2/c26-19-13-18(14-20(27)15-19)23-21-7-4-10-28-24(21)25(31-23)8-11-29(12-9-25)22(16-30)17-5-2-1-3-6-17/h1-7,10,13-15,22-23,30H,8-9,11-12,16H2
Reactome pathway
n/an/a 110n/an/an/an/an/an/a
Merck Research Laboratories
Curated by ChEMBL
Assay Description
Inhibition of mouse PrCP
Bioorg Med Chem Lett 22: 1550-6 (2012)
Article DOI: 10.1016/j.bmcl.2012.01.002
BindingDB Entry DOI: 10.7270/Q2JS9QXQ
Prolylcarboxypeptidase (PRCP)
(Homo sapiens (Human))
BDBM50364686
(CHEMBL1951475)
Show SMILES OCC(N1CCC2(CC1)OC(c1cccnc21)c1cc(Cl)cc(Cl)c1)c1ccccc1
Show InChI InChI=1S/C25H24Cl2N2O2/c26-19-13-18(14-20(27)15-19)23-21-7-4-10-28-24(21)25(31-23)8-11-29(12-9-25)22(16-30)17-5-2-1-3-6-17/h1-7,10,13-15,22-23,30H,8-9,11-12,16H2
Reactome pathway
n/an/a 200n/an/an/an/an/an/a
Merck Research Laboratories
Curated by ChEMBL
Assay Description
Inhibition of human PrCP
Bioorg Med Chem Lett 22: 1550-6 (2012)
Article DOI: 10.1016/j.bmcl.2012.01.002
BindingDB Entry DOI: 10.7270/Q2JS9QXQ