BDBM50364692 CHEMBL1951683
SMILES: COc1ccc(cc1)-n1ccc2c(sc3nccc(NC4CC4)c23)c1=O
InChI Key: InChIKey=ZUUBRGCTXRXCLV-UHFFFAOYSA-N
Data: 1 KI  1 IC50
Activity Spreadsheet -- Enzyme Inhibition Constant Data from BindingDB
Found 2 hits for monomerid = 50364692
Trg + Lig
Ki
nM
ΔG°
kcal/mole
IC50
nM
Kd
nM
EC50/IC50
nM
koff
s-1
kon
M-1s-1
pHTemp
°C
Metabotropic glutamate receptor
(RAT)
BDBM50364692
(CHEMBL1951683)
Show SMILES COc1ccc(cc1)-n1ccc2c(sc3nccc(NC4CC4)c23)c1=O
Show InChI InChI=1S/C20H17N3O2S/c1-25-14-6-4-13(5-7-14)23-11-9-15-17-16(22-12-2-3-12)8-10-21-19(17)26-18(15)20(23)24/h4-12H,2-3H2,1H3,(H,21,22)
5.20n/an/an/an/an/an/an/an/a
Merck Research Laboratories
Curated by ChEMBL
Assay Description
Antagonist activity at rat metabotropic glutamate receptor 1
Bioorg Med Chem Lett 22: 1575-8 (2012)
Article DOI: 10.1016/j.bmcl.2011.12.131
BindingDB Entry DOI: 10.7270/Q2F19063
Metabotropic glutamate receptor 1
(Homo sapiens (Human))
BDBM50364692
(CHEMBL1951683)
Show SMILES COc1ccc(cc1)-n1ccc2c(sc3nccc(NC4CC4)c23)c1=O
Show InChI InChI=1S/C20H17N3O2S/c1-25-14-6-4-13(5-7-14)23-11-9-15-17-16(22-12-2-3-12)8-10-21-19(17)26-18(15)20(23)24/h4-12H,2-3H2,1H3,(H,21,22)
n/an/a 12n/an/an/an/an/an/a
Merck Research Laboratories
Curated by ChEMBL
Assay Description
Antagonist activity at human metabotropic glutamate receptor 1
Bioorg Med Chem Lett 22: 1575-8 (2012)
Article DOI: 10.1016/j.bmcl.2011.12.131
BindingDB Entry DOI: 10.7270/Q2F19063