BDBM50364837 CHEMBL1952362
SMILES: COc1ccc(cc1\C=C\c1ccc(Cl)cc1)C(N)=O
InChI Key: InChIKey=VMCCZOBJKXHUQH-GORDUTHDSA-N
Data: 1 IC50
Activity Spreadsheet -- Enzyme Inhibition Constant Data from BindingDB
Found 1 hit for monomerid = 50364837
Trg + Lig
Ki
nM
ΔG°
kcal/mole
IC50
nM
Kd
nM
EC50/IC50
nM
koff
s-1
kon
M-1s-1
pHTemp
°C
Vascular endothelial growth factor receptor 2
(Homo sapiens (Human))
BDBM50364837
(CHEMBL1952362)
Show SMILES COc1ccc(cc1\C=C\c1ccc(Cl)cc1)C(N)=O
Show InChI InChI=1S/C16H14ClNO2/c1-20-15-9-6-13(16(18)19)10-12(15)5-2-11-3-7-14(17)8-4-11/h2-10H,1H3,(H2,18,19)/b5-2+
NCI pathway
Reactome pathway
n/an/a>5.00E+4n/an/an/an/an/an/a
Chugai Pharmaceutical Co., Ltd.
Curated by ChEMBL
Assay Description
Inhibition of VEGFR2
Bioorg Med Chem 20: 1442-60 (2012)
Article DOI: 10.1016/j.bmc.2011.12.058
BindingDB Entry DOI: 10.7270/Q2SB466W